BDBM50020612 CHEMBL3290462
SMILES: CC1Cc2cc(cc(C(N)=O)c2O1)[N+]([O-])=O
InChI Key: InChIKey=ZKQAOVSCYXKRLS-UHFFFAOYSA-N
Data: 1 IC50
Activity Spreadsheet -- Enzyme Inhibition Constant Data from BindingDB
Found 1 hit for monomerid = 50020612
Trg + Lig
Ki
nM
ΔG°
kcal/mole
IC50
nM
Kd
nM
EC50/IC50
nM
koff
s-1
kon
M-1s-1
pHTemp
°C
Poly [ADP-ribose] polymerase 1
(Homo sapiens (Human))
BDBM50020612
(CHEMBL3290462)
Show SMILES CC1Cc2cc(cc(C(N)=O)c2O1)[N+]([O-])=O
Show InChI InChI=1S/C10H10N2O4/c1-5-2-6-3-7(12(14)15)4-8(10(11)13)9(6)16-5/h3-5H,2H2,1H3,(H2,11,13)
n/an/a>2.50E+4n/an/an/an/an/an/a
St. John's University
Curated by ChEMBL
Assay Description
Inhibition of PARP-1 (unknown origin) using biotinylated NAD+ as substrate after 60 mins by spectrophotometry
J Med Chem 57: 5579-601 (2014)
Article DOI: 10.1021/jm5002502
BindingDB Entry DOI: 10.7270/Q28C9XSS