BDBM50022665 CHEMBL3299049
SMILES: Cc1ccc(cc1)-c1cc2c(CCP(O)(O)=O)ncnc2s1
InChI Key: InChIKey=XBDBJEYXXYREEM-UHFFFAOYSA-N
Data: 2 IC50
Activity Spreadsheet -- Enzyme Inhibition Constant Data from BindingDB
Found 2 hits for monomerid = 50022665
Trg + Lig
Ki
nM
ΔG°
kcal/mole
IC50
nM
Kd
nM
EC50/IC50
nM
koff
s-1
kon
M-1s-1
pHTemp
°C
Farnesyl diphosphate synthase
(Homo sapiens (Human))
BDBM50022665
(CHEMBL3299049)
Show SMILES Cc1ccc(cc1)-c1cc2c(CCP(O)(O)=O)ncnc2s1
Show InChI InChI=1S/C15H15N2O3PS/c1-10-2-4-11(5-3-10)14-8-12-13(6-7-21(18,19)20)16-9-17-15(12)22-14/h2-5,8-9H,6-7H2,1H3,(H2,18,19,20)
Reactome pathway
n/an/a 2.60E+4n/an/an/an/an/an/a
McGill University
Curated by ChEMBL
Assay Description
Allosteric inhibition of human recombinant FPPS using GPP and [3H]IPP as substrate incubated with enzyme for 10 mins prior to substrate addition by l...
J Med Chem 57: 5764-76 (2014)
Article DOI: 10.1021/jm500629e
BindingDB Entry DOI: 10.7270/Q2GH9KJR
Farnesyl diphosphate synthase
(Homo sapiens (Human))
BDBM50022665
(CHEMBL3299049)
Show SMILES Cc1ccc(cc1)-c1cc2c(CCP(O)(O)=O)ncnc2s1
Show InChI InChI=1S/C15H15N2O3PS/c1-10-2-4-11(5-3-10)14-8-12-13(6-7-21(18,19)20)16-9-17-15(12)22-14/h2-5,8-9H,6-7H2,1H3,(H2,18,19,20)
Reactome pathway
n/an/a 200n/an/an/an/an/an/a
McGill University
Curated by ChEMBL
Assay Description
Inhibition of FPPS (unknown origin)
J Med Chem 57: 5764-76 (2014)
Article DOI: 10.1021/jm500629e
BindingDB Entry DOI: 10.7270/Q2GH9KJR