BDBM50024248 CHEMBL3325528
SMILES: Fc1cc(ccc1Cl)[C@H]1CCNC[C@@H]1COc1cc(F)c(cc1F)S(=O)(=O)Nc1ncns1
InChI Key: InChIKey=VWHRVYJZRBRKQE-CHWSQXEVSA-N
Data: 2 IC50
Activity Spreadsheet -- Enzyme Inhibition Constant Data from BindingDB
Found 2 hits for monomerid = 50024248
Trg + Lig
Ki
nM
ΔG°
kcal/mole
IC50
nM
Kd
nM
EC50/IC50
nM
koff
s-1
kon
M-1s-1
pHTemp
°C
Sodium channel protein type 9 subunit alpha
(Homo sapiens (Human))
BDBM50024248
(CHEMBL3325528)
Show SMILES Fc1cc(ccc1Cl)[C@H]1CCNC[C@@H]1COc1cc(F)c(cc1F)S(=O)(=O)Nc1ncns1 |r|
Show InChI InChI=1S/C20H18ClF3N4O3S2/c21-14-2-1-11(5-15(14)22)13-3-4-25-8-12(13)9-31-18-6-17(24)19(7-16(18)23)33(29,30)28-20-26-10-27-32-20/h1-2,5-7,10,12-13,25H,3-4,8-9H2,(H,26,27,28)/t12-,13-/m1/s1
n/an/a 0.900n/an/an/an/an/an/a
Xenon Pharmaceuticals Inc.
Curated by ChEMBL
Assay Description
Inhibition of human Nav1.7 expressed in HEK cells assessed as reduction in sodium current at -60 mV holding potential by PatchXpress platform based w...
Bioorg Med Chem Lett 24: 4397-401 (2014)
Article DOI: 10.1016/j.bmcl.2014.08.017
BindingDB Entry DOI: 10.7270/Q2FF3TX9
Sodium channel protein type 5 subunit alpha
(Homo sapiens (Human))
BDBM50024248
(CHEMBL3325528)
Show SMILES Fc1cc(ccc1Cl)[C@H]1CCNC[C@@H]1COc1cc(F)c(cc1F)S(=O)(=O)Nc1ncns1 |r|
Show InChI InChI=1S/C20H18ClF3N4O3S2/c21-14-2-1-11(5-15(14)22)13-3-4-25-8-12(13)9-31-18-6-17(24)19(7-16(18)23)33(29,30)28-20-26-10-27-32-20/h1-2,5-7,10,12-13,25H,3-4,8-9H2,(H,26,27,28)/t12-,13-/m1/s1
n/an/a>1.00E+4n/an/an/an/an/an/a
Xenon Pharmaceuticals Inc.
Curated by ChEMBL
Assay Description
Inhibition of human Nav1.5 expressed in HEK cells assessed as reduction in sodium current at -60 mV holding potential by PatchXpress platform based w...
Bioorg Med Chem Lett 24: 4397-401 (2014)
Article DOI: 10.1016/j.bmcl.2014.08.017
BindingDB Entry DOI: 10.7270/Q2FF3TX9