null
SMILES: C[C@H](CNc1ccc(CC(=O)Nc2nccs2)cc1)NC[C@H](O)c1cccc(Cl)c1
InChI Key: InChIKey=XFJQPNTUWJJACN-QRWLVFNGSA-N
Activity Spreadsheet -- Enzyme Inhibition Constant Data from BindingDB
Found 3 hits for monomerid = 50027822
Trg + Lig
Ki
nM
ΔG°
kcal/mole
IC50
nM
Kd
nM
EC50/IC50
nM
koff
s-1
kon
M-1s-1
pHTemp
°C
Beta-3 adrenergic receptor
(Homo sapiens (Human))
BDBM50027822
(CHEMBL154150)
Show SMILES C[C@H](CNc1ccc(CC(=O)Nc2nccs2)cc1)NC[C@H](O)c1cccc(Cl)c1
Show InChI InChI=1S/C22H25ClN4O2S/c1-15(25-14-20(28)17-3-2-4-18(23)12-17)13-26-19-7-5-16(6-8-19)11-21(29)27-22-24-9-10-30-22/h2-10,12,15,20,25-26,28H,11,13-14H2,1H3,(H,24,27,29)/t15-,20+/m1/s1
Reactome pathway
n/an/an/an/a 1.30n/an/an/an/a
GlaxoSmithKline
Curated by ChEMBL
Assay Description
Ability to cause cAMP accumulation in CHO cells expressing human beta-3 AR expressed as the negative logarithm of the molar drug concentration
J Med Chem 45: 567-83 (2002)
BindingDB Entry DOI: 10.7270/Q2W0976P
Beta-1 adrenergic receptor
(Homo sapiens (Human))
BDBM50027822
(CHEMBL154150)
Show SMILES C[C@H](CNc1ccc(CC(=O)Nc2nccs2)cc1)NC[C@H](O)c1cccc(Cl)c1
Show InChI InChI=1S/C22H25ClN4O2S/c1-15(25-14-20(28)17-3-2-4-18(23)12-17)13-26-19-7-5-16(6-8-19)11-21(29)27-22-24-9-10-30-22/h2-10,12,15,20,25-26,28H,11,13-14H2,1H3,(H,24,27,29)/t15-,20+/m1/s1
Reactome pathway
n/an/an/an/a 3.20n/an/an/an/a
GlaxoSmithKline
Curated by ChEMBL
Assay Description
Ability to cause cAMP accumulation in CHO cells expressing human beta-1 AR expressed as the negative logarithm of the molar drug concentration
J Med Chem 45: 567-83 (2002)
BindingDB Entry DOI: 10.7270/Q2W0976P
Beta-2 adrenergic receptor
(Homo sapiens (Human))
BDBM50027822
(CHEMBL154150)
Show SMILES C[C@H](CNc1ccc(CC(=O)Nc2nccs2)cc1)NC[C@H](O)c1cccc(Cl)c1
Show InChI InChI=1S/C22H25ClN4O2S/c1-15(25-14-20(28)17-3-2-4-18(23)12-17)13-26-19-7-5-16(6-8-19)11-21(29)27-22-24-9-10-30-22/h2-10,12,15,20,25-26,28H,11,13-14H2,1H3,(H,24,27,29)/t15-,20+/m1/s1
Reactome pathway
n/an/an/an/a 7.90n/an/an/an/a
GlaxoSmithKline
Curated by ChEMBL
Assay Description
Ability to cause cAMP accumulation in CHO cells expressing human beta-2 AR expressed as the negative logarithm of the molar drug concentration
J Med Chem 45: 567-83 (2002)
BindingDB Entry DOI: 10.7270/Q2W0976P