null
SMILES: OC[C@@H]1[C@@H](O)[C@H](O)[C@@H](O)CN1CCCCCOCc1ccc2ccc3cccc4ccc1c2c34
InChI Key: InChIKey=IMYBJLKJUZUZCD-WKWYISCVSA-N
Activity Spreadsheet -- Enzyme Inhibition Constant Data from BindingDB
Found 3 hits for monomerid = 50028206
Trg + Lig
Ki
nM
ΔG°
kcal/mole
IC50
nM
Kd
nM
EC50/IC50
nM
koff
s-1
kon
M-1s-1
pHTemp
°C
Ceramide glucosyltransferase
(Homo sapiens (Human))
BDBM50028206
(CHEMBL3354024)
Show SMILES OC[C@@H]1[C@@H](O)[C@H](O)[C@@H](O)CN1CCCCCOCc1ccc2ccc3cccc4ccc1c2c34 |r|
Show InChI InChI=1S/C28H33NO5/c30-16-23-27(32)28(33)24(31)15-29(23)13-2-1-3-14-34-17-21-10-9-20-8-7-18-5-4-6-19-11-12-22(21)26(20)25(18)19/h4-12,23-24,27-28,30-33H,1-3,13-17H2/t23-,24+,27-,28-/m1/s1
NCI pathway
Reactome pathway
n/an/a 3n/an/an/an/an/an/a
Leiden University
Curated by ChEMBL
Assay Description
Inhibition of glucosylceramide synthase (unknown origin) assessed as catabolism of NBD-glucosylceramide
J Med Chem 57: 9096-104 (2014)
Article DOI: 10.1021/jm501181z
BindingDB Entry DOI: 10.7270/Q20003PT
Non-lysosomal glucosylceramidase
(Homo sapiens (Human))
BDBM50028206
(CHEMBL3354024)
Show SMILES OC[C@@H]1[C@@H](O)[C@H](O)[C@@H](O)CN1CCCCCOCc1ccc2ccc3cccc4ccc1c2c34 |r|
Show InChI InChI=1S/C28H33NO5/c30-16-23-27(32)28(33)24(31)15-29(23)13-2-1-3-14-34-17-21-10-9-20-8-7-18-5-4-6-19-11-12-22(21)26(20)25(18)19/h4-12,23-24,27-28,30-33H,1-3,13-17H2/t23-,24+,27-,28-/m1/s1
Reactome pathway
n/an/a 3n/an/an/an/an/an/a
Leiden University
Curated by ChEMBL
Assay Description
Inhibition of GBA2 (unknown origin)
J Med Chem 57: 9096-104 (2014)
Article DOI: 10.1021/jm501181z
BindingDB Entry DOI: 10.7270/Q20003PT
Lysosomal acid glucosylceramidase
(Homo sapiens (Human))
BDBM50028206
(CHEMBL3354024)
Show SMILES OC[C@@H]1[C@@H](O)[C@H](O)[C@@H](O)CN1CCCCCOCc1ccc2ccc3cccc4ccc1c2c34 |r|
Show InChI InChI=1S/C28H33NO5/c30-16-23-27(32)28(33)24(31)15-29(23)13-2-1-3-14-34-17-21-10-9-20-8-7-18-5-4-6-19-11-12-22(21)26(20)25(18)19/h4-12,23-24,27-28,30-33H,1-3,13-17H2/t23-,24+,27-,28-/m1/s1
Reactome pathway
n/an/a 500n/an/an/an/an/an/a
Leiden University
Curated by ChEMBL
Assay Description
Inhibition of GBA1 (unknown origin) using beta-D-[1-14C]glucocerebroside assessed as 4-methylumbelliferrone by fluorimetry
J Med Chem 57: 9096-104 (2014)
Article DOI: 10.1021/jm501181z
BindingDB Entry DOI: 10.7270/Q20003PT