BDBM50029557 CHEMBL3343439
SMILES: Oc1cc(Cc2ccccc2)n(O)c(=O)c1
InChI Key: InChIKey=FFONDJMUEULHQI-UHFFFAOYSA-N
Data: 3 KI  1 IC50
Activity Spreadsheet -- Enzyme Inhibition Constant Data from BindingDB
Found 4 hits for monomerid = 50029557
Trg + Lig
Ki
nM
ΔG°
kcal/mole
IC50
nM
Kd
nM
EC50/IC50
nM
koff
s-1
kon
M-1s-1
pHTemp
°C
Isocitrate dehydrogenase [NADP] cytoplasmic
(Homo sapiens (Human))
BDBM50029557
(CHEMBL3343439)
Show SMILES Oc1cc(Cc2ccccc2)n(O)c(=O)c1
Show InChI InChI=1S/C12H11NO3/c14-11-7-10(13(16)12(15)8-11)6-9-4-2-1-3-5-9/h1-5,7-8,14,16H,6H2
380n/an/an/an/an/an/an/an/a
Baylor College of Medicine
Curated by ChEMBL
Assay Description
Inhibition of human IDH1 R132H mutant expressed in Escherichia coli BL21-CodonPlus assessed as reduction in NADPH consumption
J Med Chem 57: 8307-18 (2014)
Article DOI: 10.1021/jm500660f
BindingDB Entry DOI: 10.7270/Q23J3FJR
Isocitrate dehydrogenase [NADP] cytoplasmic
(Homo sapiens (Human))
BDBM50029557
(CHEMBL3343439)
Show SMILES Oc1cc(Cc2ccccc2)n(O)c(=O)c1
Show InChI InChI=1S/C12H11NO3/c14-11-7-10(13(16)12(15)8-11)6-9-4-2-1-3-5-9/h1-5,7-8,14,16H,6H2
1.47E+4n/an/an/an/an/an/an/an/a
Baylor College of Medicine
Curated by ChEMBL
Assay Description
Inhibition of human IDH1 R132C mutant expressed in Escherichia coli BL21-CodonPlus assessed as reduction in NADPH consumption
J Med Chem 57: 8307-18 (2014)
Article DOI: 10.1021/jm500660f
BindingDB Entry DOI: 10.7270/Q23J3FJR
Isocitrate dehydrogenase [NADP] cytoplasmic
(Homo sapiens (Human))
BDBM50029557
(CHEMBL3343439)
Show SMILES Oc1cc(Cc2ccccc2)n(O)c(=O)c1
Show InChI InChI=1S/C12H11NO3/c14-11-7-10(13(16)12(15)8-11)6-9-4-2-1-3-5-9/h1-5,7-8,14,16H,6H2
>5.00E+4n/an/an/an/an/an/an/an/a
Baylor College of Medicine
Curated by ChEMBL
Assay Description
Inhibition of wild type human IDH1 expressed in Escherichia coli BL21-CodonPlus assessed as reduction in NADPH consumption
J Med Chem 57: 8307-18 (2014)
Article DOI: 10.1021/jm500660f
BindingDB Entry DOI: 10.7270/Q23J3FJR
Isocitrate dehydrogenase [NADP] cytoplasmic
(Homo sapiens (Human))
BDBM50029557
(CHEMBL3343439)
Show SMILES Oc1cc(Cc2ccccc2)n(O)c(=O)c1
Show InChI InChI=1S/C12H11NO3/c14-11-7-10(13(16)12(15)8-11)6-9-4-2-1-3-5-9/h1-5,7-8,14,16H,6H2
n/an/a>3.00E+4n/an/an/an/an/an/a
Baylor College of Medicine
Curated by ChEMBL
Assay Description
Inhibition of IDH1 R132C mutant in human HT1080 cells assessed as reduction in D2HG production incubated for 48 hrs by HPLC-MS method
J Med Chem 57: 8307-18 (2014)
Article DOI: 10.1021/jm500660f
BindingDB Entry DOI: 10.7270/Q23J3FJR