null
SMILES: Cc1cc(C)cc(Sc2c(C)c[n-]c(=[OH+])c2[N+]([O-])=O)c1
InChI Key: InChIKey=SSTLRZVPJLDOCV-UHFFFAOYSA-N
Activity Spreadsheet -- Enzyme Inhibition Constant Data from BindingDB
Found 1 hit for monomerid = 50029675
Trg + Lig
Ki
nM
ΔG°
kcal/mole
IC50
nM
Kd
nM
EC50/IC50
nM
koff
s-1
kon
M-1s-1
pHTemp
°C
Reverse transcriptase/RNaseH
(Human immunodeficiency virus 1)
BDBM50029675
(4-(3,5-Dimethyl-phenylsulfanyl)-5-methyl-3-nitro-1...)
Show SMILES Cc1cc(C)cc(Sc2c(C)c[n-]c(=[OH+])c2[N+]([O-])=O)c1
Show InChI InChI=1S/C14H14N2O3S/c1-8-4-9(2)6-11(5-8)20-13-10(3)7-15-14(17)12(13)16(18)19/h4-7H,1-3H3,(H,15,17)
n/an/a>1.00E+4n/an/an/an/an/an/a
URA 1387 CNRS
Curated by ChEMBL
Assay Description
Inhibition of HIV-1 reverse transcriptase(RT)
J Med Chem 38: 4679-86 (1995)
BindingDB Entry DOI: 10.7270/Q2QF8RWD