null
SMILES: CCCOc1nccnc1C1CN2CCC1CC2
InChI Key: InChIKey=OMUAJMMRMCPDBL-UHFFFAOYSA-N
Activity Spreadsheet -- Enzyme Inhibition Constant Data from BindingDB
Found 2 hits for monomerid = 50033154
Trg + Lig
Ki
nM
ΔG°
kcal/mole
IC50
nM
Kd
nM
EC50/IC50
nM
koff
s-1
kon
M-1s-1
pHTemp
°C
Muscarinic acetylcholine receptor M1
(RAT)
BDBM50033154
(3-(3-Propoxy-pyrazin-2-yl)-1-aza-bicyclo[2.2.2]oct...)
Show SMILES CCCOc1nccnc1C1CN2CCC1CC2 |(6.77,.18,;6.77,-1.36,;8.1,-2.13,;8.1,-3.67,;9.43,-4.44,;10.76,-3.69,;12.09,-4.46,;12.09,-6,;10.76,-6.75,;9.43,-5.98,;8.1,-6.75,;8.1,-8.29,;6.77,-9.05,;7.31,-7.51,;6.03,-7.4,;6.77,-5.97,;5.44,-6.75,;5.44,-8.29,)|
Show InChI InChI=1S/C14H21N3O/c1-2-9-18-14-13(15-5-6-16-14)12-10-17-7-3-11(12)4-8-17/h5-6,11-12H,2-4,7-10H2,1H3
Reactome pathway
n/an/a 9n/an/an/an/an/an/a
Lilly Research Laboratories
Curated by ChEMBL
Assay Description
Binding activity against muscarinic acetylcholine receptor M1 in rat brain, using [3H]OXO-M as the radioligand.
J Med Chem 38: 3469-81 (1995)
BindingDB Entry DOI: 10.7270/Q2TB17JZ
Muscarinic acetylcholine receptor M1
(RAT)
BDBM50033154
(3-(3-Propoxy-pyrazin-2-yl)-1-aza-bicyclo[2.2.2]oct...)
Show SMILES CCCOc1nccnc1C1CN2CCC1CC2 |(6.77,.18,;6.77,-1.36,;8.1,-2.13,;8.1,-3.67,;9.43,-4.44,;10.76,-3.69,;12.09,-4.46,;12.09,-6,;10.76,-6.75,;9.43,-5.98,;8.1,-6.75,;8.1,-8.29,;6.77,-9.05,;7.31,-7.51,;6.03,-7.4,;6.77,-5.97,;5.44,-6.75,;5.44,-8.29,)|
Show InChI InChI=1S/C14H21N3O/c1-2-9-18-14-13(15-5-6-16-14)12-10-17-7-3-11(12)4-8-17/h5-6,11-12H,2-4,7-10H2,1H3
Reactome pathway
n/an/a 19n/an/an/an/an/an/a
Lilly Research Laboratories
Curated by ChEMBL
Assay Description
Binding activity against muscarinic acetylcholine receptor M1 in rat brain, using [3H]-Pz as the radioligand.
J Med Chem 38: 3469-81 (1995)
BindingDB Entry DOI: 10.7270/Q2TB17JZ