BDBM50033390 CHEMBL3357650
SMILES: CCOc1cc2ncnc(Nc3ccc(Oc4ccc(C)nc4)c(Cl)c3)c2cc1NC(=O)C(\F)=C\CN(C)C
InChI Key: InChIKey=DJAMFWBXWBHEQD-YVNNLAQVSA-N
Data: 2 IC50
Activity Spreadsheet -- Enzyme Inhibition Constant Data from BindingDB
Found 2 hits for monomerid = 50033390
Trg + Lig
Ki
nM
ΔG°
kcal/mole
IC50
nM
Kd
nM
EC50/IC50
nM
koff
s-1
kon
M-1s-1
pHTemp
°C
Epidermal growth factor receptor
(Homo sapiens (Human))
BDBM50033390
(CHEMBL3357650)
Show SMILES CCOc1cc2ncnc(Nc3ccc(Oc4ccc(C)nc4)c(Cl)c3)c2cc1NC(=O)C(\F)=C\CN(C)C
Show InChI InChI=1S/C28H28ClFN6O3/c1-5-38-26-14-23-20(13-24(26)35-28(37)22(30)10-11-36(3)4)27(33-16-32-23)34-18-7-9-25(21(29)12-18)39-19-8-6-17(2)31-15-19/h6-10,12-16H,5,11H2,1-4H3,(H,35,37)(H,32,33,34)/b22-10-
n/an/a 7.10n/an/an/an/an/an/a
Zhejiang University
Curated by ChEMBL
Assay Description
Inhibition of wild type EGFR T790M mutant (unknown origin) incubated for 5 mins by HTRF assay
J Med Chem 57: 9889-900 (2014)
Article DOI: 10.1021/jm5014659
BindingDB Entry DOI: 10.7270/Q26W9CPC
Epidermal growth factor receptor
(Homo sapiens (Human))
BDBM50033390
(CHEMBL3357650)
Show SMILES CCOc1cc2ncnc(Nc3ccc(Oc4ccc(C)nc4)c(Cl)c3)c2cc1NC(=O)C(\F)=C\CN(C)C
Show InChI InChI=1S/C28H28ClFN6O3/c1-5-38-26-14-23-20(13-24(26)35-28(37)22(30)10-11-36(3)4)27(33-16-32-23)34-18-7-9-25(21(29)12-18)39-19-8-6-17(2)31-15-19/h6-10,12-16H,5,11H2,1-4H3,(H,35,37)(H,32,33,34)/b22-10-
n/an/a 4.5n/an/an/an/an/an/a
Zhejiang University
Curated by ChEMBL
Assay Description
Inhibition of wild type EGFR (unknown origin) incubated for 5 mins by HTRF assay
J Med Chem 57: 9889-900 (2014)
Article DOI: 10.1021/jm5014659
BindingDB Entry DOI: 10.7270/Q26W9CPC