BDBM50034612 CHEMBL3360378
SMILES: CC(C)Oc1ccc(cc1C#N)-c1nc(no1)-c1cccc2CN(CCCC(O)=O)Cc12
InChI Key: InChIKey=WIFSFYGVGXWESR-UHFFFAOYSA-N
Data: 2 EC50
PDB links: 155 PDB IDs match this monomer.
Activity Spreadsheet -- Enzyme Inhibition Constant Data from BindingDB
Found 2 hits for monomerid = 50034612
Trg + Lig
Ki
nM
ΔG°
kcal/mole
IC50
nM
Kd
nM
EC50/IC50
nM
koff
s-1
kon
M-1s-1
pHTemp
°C
Sphingosine 1-phosphate receptor 1
(Homo sapiens (Human))
BDBM50034612
(CHEMBL3360378)
Show SMILES CC(C)Oc1ccc(cc1C#N)-c1nc(no1)-c1cccc2CN(CCCC(O)=O)Cc12
Show InChI InChI=1S/C24H24N4O4/c1-15(2)31-21-9-8-16(11-18(21)12-25)24-26-23(27-32-24)19-6-3-5-17-13-28(14-20(17)19)10-4-7-22(29)30/h3,5-6,8-9,11,15H,4,7,10,13-14H2,1-2H3,(H,29,30)
Reactome pathway
n/an/an/an/a 398n/an/an/an/a
GlaxoSmithKline
Curated by ChEMBL
Assay Description
Agonist activity at human S1P1R expressed in RH7777 membranes assessed as [35S]GTPgammaS binding after 30 mins
J Med Chem 57: 10424-42 (2014)
Article DOI: 10.1021/jm5010336
BindingDB Entry DOI: 10.7270/Q2DF6SSX
Sphingosine 1-phosphate receptor 3
(Homo sapiens (Human))
BDBM50034612
(CHEMBL3360378)
Show SMILES CC(C)Oc1ccc(cc1C#N)-c1nc(no1)-c1cccc2CN(CCCC(O)=O)Cc12
Show InChI InChI=1S/C24H24N4O4/c1-15(2)31-21-9-8-16(11-18(21)12-25)24-26-23(27-32-24)19-6-3-5-17-13-28(14-20(17)19)10-4-7-22(29)30/h3,5-6,8-9,11,15H,4,7,10,13-14H2,1-2H3,(H,29,30)
NCI pathway
Reactome pathway
n/an/an/an/a<3.16E+4n/an/an/an/a
GlaxoSmithKline
Curated by ChEMBL
Assay Description
Agonist activity at human S1P3R expressed in RBL membranes assessed as [35S]GTPgammaS binding after 30 mins
J Med Chem 57: 10424-42 (2014)
Article DOI: 10.1021/jm5010336
BindingDB Entry DOI: 10.7270/Q2DF6SSX