BDBM50036393 CHEMBL350336::N-[4-(4-Hydroxy-3-isopropyl-phenoxy)-phenyl]-oxalamic acid
SMILES: CC(C)c1cc(Oc2ccc(NC(=O)C(O)=O)cc2)ccc1O
InChI Key: InChIKey=IYFXIQOKIGTZTQ-UHFFFAOYSA-N
Data: 2 IC50
Activity Spreadsheet -- Enzyme Inhibition Constant Data from BindingDB
Found 2 hits for monomerid = 50036393
Trg + Lig
Ki
nM
ΔG°
kcal/mole
IC50
nM
Kd
nM
EC50/IC50
nM
koff
s-1
kon
M-1s-1
pHTemp
°C
thyroid beta
(RAT)
BDBM50036393
(CHEMBL350336 | N-[4-(4-Hydroxy-3-isopropyl-phenoxy...)
Show SMILES CC(C)c1cc(Oc2ccc(NC(=O)C(O)=O)cc2)ccc1O
Show InChI InChI=1S/C17H17NO5/c1-10(2)14-9-13(7-8-15(14)19)23-12-5-3-11(4-6-12)18-16(20)17(21)22/h3-10,19H,1-2H3,(H,18,20)(H,21,22)
n/an/a>5.00E+3n/an/an/an/an/an/a
Ciba Pharmaceuticals
Curated by ChEMBL
Assay Description
In vitro inhibition of bound [125I]L-T3 rat plasma membrane 3,5,3'' L-triiodothyronine receptor
J Med Chem 38: 695-707 (1995)
BindingDB Entry DOI: 10.7270/Q2T43TRC
thyroid beta
(RAT)
BDBM50036393
(CHEMBL350336 | N-[4-(4-Hydroxy-3-isopropyl-phenoxy...)
Show SMILES CC(C)c1cc(Oc2ccc(NC(=O)C(O)=O)cc2)ccc1O
Show InChI InChI=1S/C17H17NO5/c1-10(2)14-9-13(7-8-15(14)19)23-12-5-3-11(4-6-12)18-16(20)17(21)22/h3-10,19H,1-2H3,(H,18,20)(H,21,22)
n/an/a 48n/an/an/an/an/an/a
Ciba Pharmaceuticals
Curated by ChEMBL
Assay Description
In vitro inhibition of the bound [125I]L-T3 rat liver nuclear L-triiodothyronine receptor
J Med Chem 38: 695-707 (1995)
BindingDB Entry DOI: 10.7270/Q2T43TRC