BDBM50039929 2-{4-[3-butyl-5-oxo-1-(2-trifluoromethylphenyl)-4,5-dihydro-1H-1,2,4-triazol-4-ylmethyl]phenyl}-1-(N-isopropylaminosulphonyl)benzenesulfonamide::CHEMBL316706
SMILES: CCCCc1nn(-c2ccccc2C(F)(F)F)c(=O)n1Cc1ccc(cc1)-c1ccccc1S(=O)(=O)NS(=O)(=O)C(C)C
InChI Key: InChIKey=NGRWJNOGBNJYQQ-UHFFFAOYSA-N
Data: 2 IC50
Activity Spreadsheet -- Enzyme Inhibition Constant Data from BindingDB
Found 2 hits for monomerid = 50039929
Trg + Lig
Ki
nM
ΔG°
kcal/mole
IC50
nM
Kd
nM
EC50/IC50
nM
koff
s-1
kon
M-1s-1
pHTemp
°C
Angiotensin II AT2
(RAT)
BDBM50039929
(2-{4-[3-butyl-5-oxo-1-(2-trifluoromethylphenyl)-4,...)
Show SMILES CCCCc1nn(-c2ccccc2C(F)(F)F)c(=O)n1Cc1ccc(cc1)-c1ccccc1S(=O)(=O)NS(=O)(=O)C(C)C
Show InChI InChI=1S/C29H31F3N4O5S2/c1-4-5-14-27-33-36(25-12-8-7-11-24(25)29(30,31)32)28(37)35(27)19-21-15-17-22(18-16-21)23-10-6-9-13-26(23)43(40,41)34-42(38,39)20(2)3/h6-13,15-18,20,34H,4-5,14,19H2,1-3H3
n/an/a 3.60E+3n/an/an/an/an/an/a
Merck Research Laboratories
Curated by ChEMBL
Assay Description
In vitro inhibitory activity against angiotensin II rat midbrain AT2 receptor using radioligand [125I]-Sar Ile-AII
J Med Chem 37: 2808-24 (1994)
BindingDB Entry DOI: 10.7270/Q2M907QM
Angiotensin II type 1a (AT-1a) receptor
(RABBIT)
BDBM50039929
(2-{4-[3-butyl-5-oxo-1-(2-trifluoromethylphenyl)-4,...)
Show SMILES CCCCc1nn(-c2ccccc2C(F)(F)F)c(=O)n1Cc1ccc(cc1)-c1ccccc1S(=O)(=O)NS(=O)(=O)C(C)C
Show InChI InChI=1S/C29H31F3N4O5S2/c1-4-5-14-27-33-36(25-12-8-7-11-24(25)29(30,31)32)28(37)35(27)19-21-15-17-22(18-16-21)23-10-6-9-13-26(23)43(40,41)34-42(38,39)20(2)3/h6-13,15-18,20,34H,4-5,14,19H2,1-3H3
n/an/a 0.160n/an/an/an/an/an/a
Merck Research Laboratories
Curated by ChEMBL
Assay Description
In vitro inhibitory activity against angiotensin II rabbit aorta AT1 receptor using radioligand [125I]-Sar Ile-AII
J Med Chem 37: 2808-24 (1994)
BindingDB Entry DOI: 10.7270/Q2M907QM