null
SMILES: CC1(C)CCC(C)(C)c2cc(C(=C)c3ccc(cc3)C(O)=O)c(O)cc12
InChI Key: InChIKey=GKRNNOAJHCRGSF-UHFFFAOYSA-N
Activity Spreadsheet -- Enzyme Inhibition Constant Data from BindingDB
Found 12 hits for monomerid = 50040024
Trg + Lig
Ki
nM
ΔG°
kcal/mole
IC50
nM
Kd
nM
EC50/IC50
nM
koff
s-1
kon
M-1s-1
pHTemp
°C
Retinoic acid receptor gamma
(Homo sapiens (Human))
BDBM50040024
(4-[1-(3-Hydroxy-5,5,8,8-tetramethyl-5,6,7,8-tetrah...)
Show SMILES CC1(C)CCC(C)(C)c2cc(C(=C)c3ccc(cc3)C(O)=O)c(O)cc12
Show InChI InChI=1S/C23H26O3/c1-14(15-6-8-16(9-7-15)21(25)26)17-12-18-19(13-20(17)24)23(4,5)11-10-22(18,2)3/h6-9,12-13,24H,1,10-11H2,2-5H3,(H,25,26)
Reactome pathway
n/an/an/an/a>1.00E+4n/an/an/an/a
Ligand Pharmaceuticals, Inc.
Curated by ChEMBL
Assay Description
Effective concentration against retinoid receptor isoform (RAR gamma) expressed in CV-1 cells
J Med Chem 37: 2930-41 (1994)
BindingDB Entry DOI: 10.7270/Q27080G3
Retinoic acid receptor RXR-beta
(Mus musculus)
BDBM50040024
(4-[1-(3-Hydroxy-5,5,8,8-tetramethyl-5,6,7,8-tetrah...)
Show SMILES CC1(C)CCC(C)(C)c2cc(C(=C)c3ccc(cc3)C(O)=O)c(O)cc12
Show InChI InChI=1S/C23H26O3/c1-14(15-6-8-16(9-7-15)21(25)26)17-12-18-19(13-20(17)24)23(4,5)11-10-22(18,2)3/h6-9,12-13,24H,1,10-11H2,2-5H3,(H,25,26)
Reactome pathway
n/an/an/an/a 202n/an/an/an/a
Ligand Pharmaceuticals, Inc.
Curated by ChEMBL
Assay Description
Effective concentration against retinoid receptor isoform (RXR beta) expressed in CV-1 cells
J Med Chem 37: 2930-41 (1994)
BindingDB Entry DOI: 10.7270/Q27080G3
Retinoic acid receptor beta
(Homo sapiens (Human))
BDBM50040024
(4-[1-(3-Hydroxy-5,5,8,8-tetramethyl-5,6,7,8-tetrah...)
Show SMILES CC1(C)CCC(C)(C)c2cc(C(=C)c3ccc(cc3)C(O)=O)c(O)cc12
Show InChI InChI=1S/C23H26O3/c1-14(15-6-8-16(9-7-15)21(25)26)17-12-18-19(13-20(17)24)23(4,5)11-10-22(18,2)3/h6-9,12-13,24H,1,10-11H2,2-5H3,(H,25,26)
Reactome pathway
n/an/an/an/a 2.24E+3n/an/an/an/a
Ligand Pharmaceuticals, Inc.
Curated by ChEMBL
Assay Description
Effective concentration against retinoid receptor isoform (RAR beta) expressed in CV-1 cells
J Med Chem 37: 2930-41 (1994)
BindingDB Entry DOI: 10.7270/Q27080G3
Retinoic acid receptor alpha
(Homo sapiens (Human))
BDBM50040024
(4-[1-(3-Hydroxy-5,5,8,8-tetramethyl-5,6,7,8-tetrah...)
Show SMILES CC1(C)CCC(C)(C)c2cc(C(=C)c3ccc(cc3)C(O)=O)c(O)cc12
Show InChI InChI=1S/C23H26O3/c1-14(15-6-8-16(9-7-15)21(25)26)17-12-18-19(13-20(17)24)23(4,5)11-10-22(18,2)3/h6-9,12-13,24H,1,10-11H2,2-5H3,(H,25,26)
NCI pathway
Reactome pathway
n/an/an/an/a>1.00E+4n/an/an/an/a
Ligand Pharmaceuticals, Inc.
Curated by ChEMBL
Assay Description
Effective concentration against retinoid receptor isoform (RAR alpha) expressed in CV-1 cells
J Med Chem 37: 2930-41 (1994)
BindingDB Entry DOI: 10.7270/Q27080G3
Retinoic acid receptor RXR-alpha
(Homo sapiens (Human))
BDBM50040024
(4-[1-(3-Hydroxy-5,5,8,8-tetramethyl-5,6,7,8-tetrah...)
Show SMILES CC1(C)CCC(C)(C)c2cc(C(=C)c3ccc(cc3)C(O)=O)c(O)cc12
Show InChI InChI=1S/C23H26O3/c1-14(15-6-8-16(9-7-15)21(25)26)17-12-18-19(13-20(17)24)23(4,5)11-10-22(18,2)3/h6-9,12-13,24H,1,10-11H2,2-5H3,(H,25,26)
NCI pathway
Reactome pathway
n/an/an/a 487n/an/an/an/an/a
Ligand Pharmaceuticals, Inc.
Curated by ChEMBL
Assay Description
Inhibition of [3H]-9-cis-RA binding to baculovirus expressed retinoid receptor RXR alpha
J Med Chem 37: 2930-41 (1994)
BindingDB Entry DOI: 10.7270/Q27080G3
Retinoic acid receptor gamma
(Homo sapiens (Human))
BDBM50040024
(4-[1-(3-Hydroxy-5,5,8,8-tetramethyl-5,6,7,8-tetrah...)
Show SMILES CC1(C)CCC(C)(C)c2cc(C(=C)c3ccc(cc3)C(O)=O)c(O)cc12
Show InChI InChI=1S/C23H26O3/c1-14(15-6-8-16(9-7-15)21(25)26)17-12-18-19(13-20(17)24)23(4,5)11-10-22(18,2)3/h6-9,12-13,24H,1,10-11H2,2-5H3,(H,25,26)
Reactome pathway
n/an/an/a>1.00E+3n/an/an/an/an/a
Ligand Pharmaceuticals, Inc.
Curated by ChEMBL
Assay Description
Tested for binding affinity against [3H]-ATRA binding to retinoid receptor isoform (RAR gamma) expressed in baculovirus
J Med Chem 37: 2930-41 (1994)
BindingDB Entry DOI: 10.7270/Q27080G3
Retinoic acid receptor RXR-gamma
(Mus musculus)
BDBM50040024
(4-[1-(3-Hydroxy-5,5,8,8-tetramethyl-5,6,7,8-tetrah...)
Show SMILES CC1(C)CCC(C)(C)c2cc(C(=C)c3ccc(cc3)C(O)=O)c(O)cc12
Show InChI InChI=1S/C23H26O3/c1-14(15-6-8-16(9-7-15)21(25)26)17-12-18-19(13-20(17)24)23(4,5)11-10-22(18,2)3/h6-9,12-13,24H,1,10-11H2,2-5H3,(H,25,26)
Reactome pathway
n/an/an/a 812n/an/an/an/an/a
Ligand Pharmaceuticals, Inc.
Curated by ChEMBL
Assay Description
Inhibition of [3H]-9-cis-RA binding to baculovirus expressed retinoid receptor RXR gamma
J Med Chem 37: 2930-41 (1994)
BindingDB Entry DOI: 10.7270/Q27080G3
Retinoic acid receptor alpha
(Homo sapiens (Human))
BDBM50040024
(4-[1-(3-Hydroxy-5,5,8,8-tetramethyl-5,6,7,8-tetrah...)
Show SMILES CC1(C)CCC(C)(C)c2cc(C(=C)c3ccc(cc3)C(O)=O)c(O)cc12
Show InChI InChI=1S/C23H26O3/c1-14(15-6-8-16(9-7-15)21(25)26)17-12-18-19(13-20(17)24)23(4,5)11-10-22(18,2)3/h6-9,12-13,24H,1,10-11H2,2-5H3,(H,25,26)
NCI pathway
Reactome pathway
n/an/an/a>1.00E+3n/an/an/an/an/a
Ligand Pharmaceuticals, Inc.
Curated by ChEMBL
Assay Description
Inhibition of [3H]-ATRA binding to baculovirus expressed retinoid receptor RAR alpha
J Med Chem 37: 2930-41 (1994)
BindingDB Entry DOI: 10.7270/Q27080G3
Retinoic acid receptor RXR-beta
(Mus musculus)
BDBM50040024
(4-[1-(3-Hydroxy-5,5,8,8-tetramethyl-5,6,7,8-tetrah...)
Show SMILES CC1(C)CCC(C)(C)c2cc(C(=C)c3ccc(cc3)C(O)=O)c(O)cc12
Show InChI InChI=1S/C23H26O3/c1-14(15-6-8-16(9-7-15)21(25)26)17-12-18-19(13-20(17)24)23(4,5)11-10-22(18,2)3/h6-9,12-13,24H,1,10-11H2,2-5H3,(H,25,26)
Reactome pathway
n/an/an/a 822n/an/an/an/an/a
Ligand Pharmaceuticals, Inc.
Curated by ChEMBL
Assay Description
Inhibition of [3H]-9-cis-RA binding to baculovirus expressed retinoid receptor RXR beta
J Med Chem 37: 2930-41 (1994)
BindingDB Entry DOI: 10.7270/Q27080G3
Retinoic acid receptor beta
(Homo sapiens (Human))
BDBM50040024
(4-[1-(3-Hydroxy-5,5,8,8-tetramethyl-5,6,7,8-tetrah...)
Show SMILES CC1(C)CCC(C)(C)c2cc(C(=C)c3ccc(cc3)C(O)=O)c(O)cc12
Show InChI InChI=1S/C23H26O3/c1-14(15-6-8-16(9-7-15)21(25)26)17-12-18-19(13-20(17)24)23(4,5)11-10-22(18,2)3/h6-9,12-13,24H,1,10-11H2,2-5H3,(H,25,26)
Reactome pathway
n/an/an/a>1.00E+3n/an/an/an/an/a
Ligand Pharmaceuticals, Inc.
Curated by ChEMBL
Assay Description
Inhibition of [3H]-ATRA binding to baculovirus expressed retinoid receptor RAR beta
J Med Chem 37: 2930-41 (1994)
BindingDB Entry DOI: 10.7270/Q27080G3
Retinoic acid receptor RXR-alpha
(Homo sapiens (Human))
BDBM50040024
(4-[1-(3-Hydroxy-5,5,8,8-tetramethyl-5,6,7,8-tetrah...)
Show SMILES CC1(C)CCC(C)(C)c2cc(C(=C)c3ccc(cc3)C(O)=O)c(O)cc12
Show InChI InChI=1S/C23H26O3/c1-14(15-6-8-16(9-7-15)21(25)26)17-12-18-19(13-20(17)24)23(4,5)11-10-22(18,2)3/h6-9,12-13,24H,1,10-11H2,2-5H3,(H,25,26)
NCI pathway
Reactome pathway
n/an/an/an/a 455n/an/an/an/a
Ligand Pharmaceuticals, Inc.
Curated by ChEMBL
Assay Description
Effective concentration against retinoid receptor isoform (RXR alpha) expressed in CV-1 cells
J Med Chem 37: 2930-41 (1994)
BindingDB Entry DOI: 10.7270/Q27080G3
Retinoic acid receptor RXR-gamma
(Mus musculus)
BDBM50040024
(4-[1-(3-Hydroxy-5,5,8,8-tetramethyl-5,6,7,8-tetrah...)
Show SMILES CC1(C)CCC(C)(C)c2cc(C(=C)c3ccc(cc3)C(O)=O)c(O)cc12
Show InChI InChI=1S/C23H26O3/c1-14(15-6-8-16(9-7-15)21(25)26)17-12-18-19(13-20(17)24)23(4,5)11-10-22(18,2)3/h6-9,12-13,24H,1,10-11H2,2-5H3,(H,25,26)
Reactome pathway
n/an/an/an/a 558n/an/an/an/a
Ligand Pharmaceuticals, Inc.
Curated by ChEMBL
Assay Description
Effective concentration against retinoid receptor isoform (RXR gamma) expressed in CV-1 cells
J Med Chem 37: 2930-41 (1994)
BindingDB Entry DOI: 10.7270/Q27080G3