BDBM50040978 CHEMBL3354967
SMILES: [H][C@]12C[C@@]1([H])c1c(C2)c(nn1-c1ccccc1)C(=O)NC(C)(C)CO
InChI Key: InChIKey=JQYHRKRHFMYNNN-DGCLKSJQSA-N
Data: 4 EC50
Activity Spreadsheet -- Enzyme Inhibition Constant Data from BindingDB
Found 4 hits for monomerid = 50040978
Trg + Lig
Ki
nM
ΔG°
kcal/mole
IC50
nM
Kd
nM
EC50/IC50
nM
koff
s-1
kon
M-1s-1
pHTemp
°C
Cannabinoid receptor 2
(Homo sapiens (Human))
BDBM50040978
(CHEMBL3354967)
Show SMILES [H][C@]12C[C@@]1([H])c1c(C2)c(nn1-c1ccccc1)C(=O)NC(C)(C)CO |r|
Show InChI InChI=1S/C18H21N3O2/c1-18(2,10-22)19-17(23)15-14-9-11-8-13(11)16(14)21(20-15)12-6-4-3-5-7-12/h3-7,11,13,22H,8-10H2,1-2H3,(H,19,23)/t11-,13-/m1/s1
Reactome pathway
n/an/an/an/a 101n/an/an/an/a
Arena Pharmaceuticals
Curated by ChEMBL
Assay Description
Agonist activity at human recombinant CB2 receptor expressed in CHOK1 cells assessed as cAMP accumulation by HTRF method
Bioorg Med Chem Lett 25: 322-6 (2014)
Article DOI: 10.1016/j.bmcl.2014.11.040
BindingDB Entry DOI: 10.7270/Q21J9CDS
Cannabinoid receptor 1
(Rattus norvegicus (rat))
BDBM50040978
(CHEMBL3354967)
Show SMILES [H][C@]12C[C@@]1([H])c1c(C2)c(nn1-c1ccccc1)C(=O)NC(C)(C)CO |r|
Show InChI InChI=1S/C18H21N3O2/c1-18(2,10-22)19-17(23)15-14-9-11-8-13(11)16(14)21(20-15)12-6-4-3-5-7-12/h3-7,11,13,22H,8-10H2,1-2H3,(H,19,23)/t11-,13-/m1/s1
Reactome pathway
n/an/an/an/a>3.00E+4n/an/an/an/a
Arena Pharmaceuticals
Curated by ChEMBL
Assay Description
Agonist activity at rat recombinant CB1 receptor expressed in CHOK1 cells assessed as cAMP accumulation by HTRF method
Bioorg Med Chem Lett 25: 322-6 (2014)
Article DOI: 10.1016/j.bmcl.2014.11.040
BindingDB Entry DOI: 10.7270/Q21J9CDS
Cannabinoid receptor 2
(Rattus norvegicus (Rat))
BDBM50040978
(CHEMBL3354967)
Show SMILES [H][C@]12C[C@@]1([H])c1c(C2)c(nn1-c1ccccc1)C(=O)NC(C)(C)CO |r|
Show InChI InChI=1S/C18H21N3O2/c1-18(2,10-22)19-17(23)15-14-9-11-8-13(11)16(14)21(20-15)12-6-4-3-5-7-12/h3-7,11,13,22H,8-10H2,1-2H3,(H,19,23)/t11-,13-/m1/s1
n/an/an/an/a 326n/an/an/an/a
Arena Pharmaceuticals
Curated by ChEMBL
Assay Description
Agonist activity at rat recombinant CB2 receptor expressed in CHOK1 cells assessed as cAMP accumulation by HTRF method
Bioorg Med Chem Lett 25: 322-6 (2014)
Article DOI: 10.1016/j.bmcl.2014.11.040
BindingDB Entry DOI: 10.7270/Q21J9CDS
Cannabinoid receptor 1
(Homo sapiens (Human))
BDBM50040978
(CHEMBL3354967)
Show SMILES [H][C@]12C[C@@]1([H])c1c(C2)c(nn1-c1ccccc1)C(=O)NC(C)(C)CO |r|
Show InChI InChI=1S/C18H21N3O2/c1-18(2,10-22)19-17(23)15-14-9-11-8-13(11)16(14)21(20-15)12-6-4-3-5-7-12/h3-7,11,13,22H,8-10H2,1-2H3,(H,19,23)/t11-,13-/m1/s1
NCI pathway
Reactome pathway
n/an/an/an/a>3.00E+4n/an/an/an/a
Arena Pharmaceuticals
Curated by ChEMBL
Assay Description
Agonist activity at human recombinant CB1 receptor expressed in CHOK1 cells assessed as cAMP accumulation by HTRF method
Bioorg Med Chem Lett 25: 322-6 (2014)
Article DOI: 10.1016/j.bmcl.2014.11.040
BindingDB Entry DOI: 10.7270/Q21J9CDS