null
SMILES: C[C@H]1C2Cc3ccc(O)cc3[C@@]1(C)CCN2CC=C
InChI Key: InChIKey=LGQCVMYAEFTEFN-VUOHQMJNSA-N
Activity Spreadsheet -- Enzyme Inhibition Constant Data from BindingDB
Found 6 hits for monomerid = 50041240
Trg + Lig
Ki
nM
ΔG°
kcal/mole
IC50
nM
Kd
nM
EC50/IC50
nM
koff
s-1
kon
M-1s-1
pHTemp
°C
Sigma non-opioid intracellular receptor 1
(Homo sapiens (Human))
BDBM50041240
((6S,11R)-3-Allyl-6,11-dimethyl-1,2,3,4,5,6-hexahyd...)
Show SMILES C[C@H]1C2Cc3ccc(O)cc3[C@@]1(C)CCN2CC=C |TLB:9:10:1:15.13.14,16:15:1:10.4.3|
Show InChI InChI=1S/C17H23NO/c1-4-8-18-9-7-17(3)12(2)16(18)10-13-5-6-14(19)11-15(13)17/h4-6,11-12,16,19H,1,7-10H2,2-3H3/t12-,16?,17-/m0/s1
150n/an/an/an/an/an/an/an/a
Virginia Commonwealth University
Curated by ChEMBL
Assay Description
Tested for binding affinity against sigma receptors
J Med Chem 37: 1214-9 (1994)
BindingDB Entry DOI: 10.7270/Q29P30QV
Sigma non-opioid intracellular receptor 1
(Homo sapiens (Human))
BDBM50041240
((6S,11R)-3-Allyl-6,11-dimethyl-1,2,3,4,5,6-hexahyd...)
Show SMILES C[C@H]1C2Cc3ccc(O)cc3[C@@]1(C)CCN2CC=C |TLB:9:10:1:15.13.14,16:15:1:10.4.3|
Show InChI InChI=1S/C17H23NO/c1-4-8-18-9-7-17(3)12(2)16(18)10-13-5-6-14(19)11-15(13)17/h4-6,11-12,16,19H,1,7-10H2,2-3H3/t12-,16?,17-/m0/s1
150n/an/an/an/an/an/an/an/a
Virginia Commonwealth University
Curated by ChEMBL
Assay Description
Tested for binding affinity against sigma receptors
J Med Chem 37: 1214-9 (1994)
BindingDB Entry DOI: 10.7270/Q29P30QV
Delta-type opioid receptor
(MOUSE)
BDBM50041240
((6S,11R)-3-Allyl-6,11-dimethyl-1,2,3,4,5,6-hexahyd...)
Show SMILES C[C@H]1C2Cc3ccc(O)cc3[C@@]1(C)CCN2CC=C |TLB:9:10:1:15.13.14,16:15:1:10.4.3|
Show InChI InChI=1S/C17H23NO/c1-4-8-18-9-7-17(3)12(2)16(18)10-13-5-6-14(19)11-15(13)17/h4-6,11-12,16,19H,1,7-10H2,2-3H3/t12-,16?,17-/m0/s1
Reactome pathway
5.5n/an/an/an/an/an/an/an/a
Virginia Commonwealth University
Curated by ChEMBL
Assay Description
Ki value determined against Opioid receptor delta 1 using [3H]-DPDPE at the Kd concentration 2.1 nM
J Med Chem 43: 5030-6 (2001)
BindingDB Entry DOI: 10.7270/Q2CV4H0C
Sigma non-opioid intracellular receptor 1
(Mus musculus (Mouse))
BDBM50041240
((6S,11R)-3-Allyl-6,11-dimethyl-1,2,3,4,5,6-hexahyd...)
Show SMILES C[C@H]1C2Cc3ccc(O)cc3[C@@]1(C)CCN2CC=C |TLB:9:10:1:15.13.14,16:15:1:10.4.3|
Show InChI InChI=1S/C17H23NO/c1-4-8-18-9-7-17(3)12(2)16(18)10-13-5-6-14(19)11-15(13)17/h4-6,11-12,16,19H,1,7-10H2,2-3H3/t12-,16?,17-/m0/s1
1.10E+4n/an/an/an/an/an/an/an/a
Virginia Commonwealth University
Curated by ChEMBL
Assay Description
Ki value determined against Sigma opioid receptor type 1 using [(+)-[3H]pentazocaine at the Kd concentration 2nM
J Med Chem 43: 5030-6 (2001)
BindingDB Entry DOI: 10.7270/Q2CV4H0C
Kappa-type opioid receptor
(Mus musculus (Mouse))
BDBM50041240
((6S,11R)-3-Allyl-6,11-dimethyl-1,2,3,4,5,6-hexahyd...)
Show SMILES C[C@H]1C2Cc3ccc(O)cc3[C@@]1(C)CCN2CC=C |TLB:9:10:1:15.13.14,16:15:1:10.4.3|
Show InChI InChI=1S/C17H23NO/c1-4-8-18-9-7-17(3)12(2)16(18)10-13-5-6-14(19)11-15(13)17/h4-6,11-12,16,19H,1,7-10H2,2-3H3/t12-,16?,17-/m0/s1
0.300n/an/an/an/an/an/an/an/a
Virginia Commonwealth University
Curated by ChEMBL
Assay Description
Ki value determined against Opioid receptor kappa 1 using [3H]U69, 593 at the Kd concentration 0.95 nM
J Med Chem 43: 5030-6 (2001)
BindingDB Entry DOI: 10.7270/Q2CV4H0C
Mu-type opioid receptor
(MOUSE)
BDBM50041240
((6S,11R)-3-Allyl-6,11-dimethyl-1,2,3,4,5,6-hexahyd...)
Show SMILES C[C@H]1C2Cc3ccc(O)cc3[C@@]1(C)CCN2CC=C |TLB:9:10:1:15.13.14,16:15:1:10.4.3|
Show InChI InChI=1S/C17H23NO/c1-4-8-18-9-7-17(3)12(2)16(18)10-13-5-6-14(19)11-15(13)17/h4-6,11-12,16,19H,1,7-10H2,2-3H3/t12-,16?,17-/m0/s1
Reactome pathway
0.900n/an/an/an/an/an/an/an/a
Virginia Commonwealth University
Curated by ChEMBL
Assay Description
Ki value determined against Opioid receptor mu 1 using [3H]-DAMGO at the Kd concentration 0.57 nM
J Med Chem 43: 5030-6 (2001)
BindingDB Entry DOI: 10.7270/Q2CV4H0C