BDBM50041505 CHEMBL33096::Dimethyl-carbamic acid 5-(4-methoxy-phenyl)-6-thia-10b-aza-benzo[e]azulen-4-yl ester
SMILES: COc1ccc(cc1)C1=C(OC(=O)N(C)C)c2cccn2-c2ccccc2S1
InChI Key: InChIKey=RGAJIKNGJBAVQP-UHFFFAOYSA-N
Data: 3 IC50
Activity Spreadsheet -- Enzyme Inhibition Constant Data from BindingDB
Found 3 hits for monomerid = 50041505
Trg + Lig
Ki
nM
ΔG°
kcal/mole
IC50
nM
Kd
nM
EC50/IC50
nM
koff
s-1
kon
M-1s-1
pHTemp
°C
Peripheral-Type Benzodiazepine Receptor
(Rattus norvegicus (rat))
BDBM50041505
(CHEMBL33096 | Dimethyl-carbamic acid 5-(4-methoxy-...)
Show SMILES COc1ccc(cc1)C1=C(OC(=O)N(C)C)c2cccn2-c2ccccc2S1 |c:9|
Show InChI InChI=1S/C22H20N2O3S/c1-23(2)22(25)27-20-18-8-6-14-24(18)17-7-4-5-9-19(17)28-21(20)15-10-12-16(26-3)13-11-15/h4-14H,1-3H3
n/an/a 9.10n/an/an/an/an/an/a
Universit£ di Napoli
Curated by ChEMBL
Assay Description
Displacement of [3H]-PK 11195 from rat peripheral (mitochondrial) benzodiazepine receptor
J Med Chem 37: 4100-8 (1995)
BindingDB Entry DOI: 10.7270/Q2XD129C
Peripheral-Type Benzodiazepine Receptor
(Rattus norvegicus (rat))
BDBM50041505
(CHEMBL33096 | Dimethyl-carbamic acid 5-(4-methoxy-...)
Show SMILES COc1ccc(cc1)C1=C(OC(=O)N(C)C)c2cccn2-c2ccccc2S1 |c:9|
Show InChI InChI=1S/C22H20N2O3S/c1-23(2)22(25)27-20-18-8-6-14-24(18)17-7-4-5-9-19(17)28-21(20)15-10-12-16(26-3)13-11-15/h4-14H,1-3H3
n/an/a 9n/an/an/an/an/an/a
Universit£ di Siena
Curated by ChEMBL
Assay Description
Ability to inhibit [3H]-PK 11195 binding to peripheral-type benzodiazepine receptor(PBR) in rat cerebral cortex homogenate.
J Med Chem 39: 2922-38 (1996)
Article DOI: 10.1021/jm960162z
BindingDB Entry DOI: 10.7270/Q2HH6KQ5
Peripheral-Type Benzodiazepine Receptor
(Rattus norvegicus (rat))
BDBM50041505
(CHEMBL33096 | Dimethyl-carbamic acid 5-(4-methoxy-...)
Show SMILES COc1ccc(cc1)C1=C(OC(=O)N(C)C)c2cccn2-c2ccccc2S1 |c:9|
Show InChI InChI=1S/C22H20N2O3S/c1-23(2)22(25)27-20-18-8-6-14-24(18)17-7-4-5-9-19(17)28-21(20)15-10-12-16(26-3)13-11-15/h4-14H,1-3H3
n/an/a 9n/an/an/an/an/an/a
Universit£ di Siena
Curated by ChEMBL
Assay Description
Displacement of [3H]-PK 11195 from peripheral (mitochondrial) benzodiazepine receptor
J Med Chem 37: 1427-38 (1994)
BindingDB Entry DOI: 10.7270/Q2668DVR