null
SMILES: COc1ccc(cc1OC1CCCC1)C(=O)Nc1c(Cl)c(F)nc(F)c1Cl
InChI Key: InChIKey=UTTRDACLMAMUJY-UHFFFAOYSA-N
Activity Spreadsheet -- Enzyme Inhibition Constant Data from BindingDB
Found 1 hit for monomerid = 50041875
Trg + Lig
Ki
nM
ΔG°
kcal/mole
IC50
nM
Kd
nM
EC50/IC50
nM
koff
s-1
kon
M-1s-1
pHTemp
°C
3',5'-cyclic-AMP phosphodiesterase
(Sus scrofa)
BDBM50041875
(3-Cyclopentyloxy-N-(3,5-dichloro-2,6-difluoro-pyri...)
Show SMILES COc1ccc(cc1OC1CCCC1)C(=O)Nc1c(Cl)c(F)nc(F)c1Cl
Show InChI InChI=1S/C18H16Cl2F2N2O3/c1-26-11-7-6-9(8-12(11)27-10-4-2-3-5-10)18(25)23-15-13(19)16(21)24-17(22)14(15)20/h6-8,10H,2-5H2,1H3,(H,23,24,25)
n/an/a 20n/an/an/an/an/an/a
Rhône-Poulenc Rorer Central Research
Curated by ChEMBL
Assay Description
Inhibitory potency against pig aortic PDE IV
J Med Chem 37: 1696-703 (1994)
BindingDB Entry DOI: 10.7270/Q2CF9P5F