BDBM50045179 (R)-4-[2-(3,4-Dichloro-phenyl)-acetyl]-3-pyrrolidin-1-ylmethyl-piperazine-1-carboxylic acid methyl ester::(R)-methyl 4-(2-(3,4-dichlorophenyl)acetyl)-3-(pyrrolidin-1-ylmethyl)piperazine-1-carboxylate::(S)-4-[2-(3,4-Dichloro-phenyl)-acetyl]-3-pyrrolidin-1-ylmethyl-piperazine-1-carboxylic acid methyl ester::4-[2-(3,4-Dichloro-phenyl)-acetyl]-3-pyrrolidin-1-ylmethyl-piperazine-1-carboxylic acid methyl ester::4-[2-(3,4-Dichloro-phenyl)-acetyl]-3-pyrrolidin-1-ylmethyl-piperazine-1-carboxylic acid methyl ester(GR89696)::CHEMBL277863::GR-103545::GR-89696
SMILES: COC(=O)N1CCN([C@@H](CN2CCCC2)C1)C(=O)Cc1ccc(Cl)c(Cl)c1
InChI Key: InChIKey=HJUAKZYKCANOOZ-HNNXBMFYSA-N
Data: 1 IC50
Activity Spreadsheet -- Enzyme Inhibition Constant Data from BindingDB
Found 1 hit for monomerid = 50045179
Trg + Lig
Ki
nM
ΔG°
kcal/mole
IC50
nM
Kd
nM
EC50/IC50
nM
koff
s-1
kon
M-1s-1
pHTemp
°C
Kappa-type opioid receptor
(Homo sapiens (Human))
BDBM50045179
((R)-4-[2-(3,4-Dichloro-phenyl)-acetyl]-3-pyrrolidi...)
Show SMILES COC(=O)N1CCN([C@@H](CN2CCCC2)C1)C(=O)Cc1ccc(Cl)c(Cl)c1
Show InChI InChI=1S/C19H25Cl2N3O3/c1-27-19(26)23-8-9-24(15(13-23)12-22-6-2-3-7-22)18(25)11-14-4-5-16(20)17(21)10-14/h4-5,10,15H,2-3,6-9,11-13H2,1H3/t15-/m0/s1
Reactome pathway
n/an/a 0.0200n/an/an/an/an/an/a
TBA
Curated by ChEMBL
Assay Description
Agonistic activity at kappa opioid receptor of rabbit vas deferens
Bioorg Med Chem Lett 2: 1275-1278 (1992)
Article DOI: 10.1016/S0960-894X(00)80229-2
BindingDB Entry DOI: 10.7270/Q2125SKN