BDBM50045414 CHEMBL3314151
SMILES: FC(F)(F)c1cc(ccc1-n1ccnc1-c1ccc(o1)-c1ccc(cc1)C#N)N1CCNCC1
InChI Key: InChIKey=ZNCDIMHJRBNKSQ-UHFFFAOYSA-N
Data: 1 IC50
Activity Spreadsheet -- Enzyme Inhibition Constant Data from BindingDB
Found 1 hit for monomerid = 50045414
Trg + Lig
Ki
nM
ΔG°
kcal/mole
IC50
nM
Kd
nM
EC50/IC50
nM
koff
s-1
kon
M-1s-1
pHTemp
°C
MAP kinase-activated protein kinase 2
(Homo sapiens (Human))
BDBM50045414
(CHEMBL3314151)
Show SMILES FC(F)(F)c1cc(ccc1-n1ccnc1-c1ccc(o1)-c1ccc(cc1)C#N)N1CCNCC1
Show InChI InChI=1S/C25H20F3N5O/c26-25(27,28)20-15-19(32-12-9-30-10-13-32)5-6-21(20)33-14-11-31-24(33)23-8-7-22(34-23)18-3-1-17(16-29)2-4-18/h1-8,11,14-15,30H,9-10,12-13H2
NCI pathway
Reactome pathway
n/an/a 31n/an/an/an/an/an/a
Merck Research Laboratories
Curated by ChEMBL
Assay Description
Inhibition of MK2 (unknown origin) incubated for 30 mins by MK2 IMAP assay
Bioorg Med Chem Lett 24: 3609-13 (2014)
Article DOI: 10.1016/j.bmcl.2014.05.024
BindingDB Entry DOI: 10.7270/Q2F47QR7