null
SMILES: CN(C)Cc1ccc2CN(CCc2c1)C(=O)c1cc2cc(I)ncc2n1C
InChI Key: InChIKey=FWFGMQXFTQROKB-UHFFFAOYSA-N
Activity Spreadsheet -- Enzyme Inhibition Constant Data from BindingDB
Found 1 hit for monomerid = 50045842
Trg + Lig
Ki
nM
ΔG°
kcal/mole
IC50
nM
Kd
nM
EC50/IC50
nM
koff
s-1
kon
M-1s-1
pHTemp
°C
Pyroglutamylated RF-amide peptide receptor
(Homo sapiens (Human))
BDBM50045842
(CHEMBL3314354)
Show SMILES CN(C)Cc1ccc2CN(CCc2c1)C(=O)c1cc2cc(I)ncc2n1C
Show InChI InChI=1S/C21H23IN4O/c1-24(2)12-14-4-5-16-13-26(7-6-15(16)8-14)21(27)18-9-17-10-20(22)23-11-19(17)25(18)3/h4-5,8-11H,6-7,12-13H2,1-3H3
n/an/a 130n/an/an/an/an/an/a
AstraZeneca
Curated by ChEMBL
Assay Description
Inhibition of human GPR103 receptor expressed in CHOK1 cells by IP-1 assay
J Med Chem 57: 5935-48 (2014)
Article DOI: 10.1021/jm401951t
BindingDB Entry DOI: 10.7270/Q2MP54W9