BDBM50046794 2-Benzyl-N*1*-[1-(1-cyclohexylmethyl-2,3-dihydroxy-5-methyl-hexylcarbamoyl)-2-thiazol-4-yl-ethyl]-N*4*-methyl-N*4*-(2-pyridin-2-yl-ethyl)-succinamide::CHEMBL343968
SMILES: CC(C)C[C@H](O)[C@H](O)[C@H](CC1CCCCC1)NC(=O)[C@H](Cc1cscn1)NC(=O)[C@@H](CC(=O)N(C)CCc1ccccn1)Cc1ccccc1
InChI Key: InChIKey=FTOFUXGQJCLRCU-UOXQYSJJSA-N
Data: 4 IC50
Activity Spreadsheet -- Enzyme Inhibition Constant Data from BindingDB
Found 4 hits for monomerid = 50046794
Trg + Lig
Ki
nM
ΔG°
kcal/mole
IC50
nM
Kd
nM
EC50/IC50
nM
koff
s-1
kon
M-1s-1
pHTemp
°C
Renin
(Homo sapiens (Human))
BDBM50046794
(2-Benzyl-N*1*-[1-(1-cyclohexylmethyl-2,3-dihydroxy...)
Show SMILES CC(C)C[C@H](O)[C@H](O)[C@H](CC1CCCCC1)NC(=O)[C@H](Cc1cscn1)NC(=O)[C@@H](CC(=O)N(C)CCc1ccccn1)Cc1ccccc1
Show InChI InChI=1S/C39H55N5O5S/c1-27(2)20-35(45)37(47)33(22-29-14-8-5-9-15-29)42-39(49)34(24-32-25-50-26-41-32)43-38(48)30(21-28-12-6-4-7-13-28)23-36(46)44(3)19-17-31-16-10-11-18-40-31/h4,6-7,10-13,16,18,25-27,29-30,33-35,37,45,47H,5,8-9,14-15,17,19-24H2,1-3H3,(H,42,49)(H,43,48)/t30-,33+,34+,35+,37-/m1/s1
Reactome pathway
n/an/a 33n/an/an/an/a7.4n/a
Abbott Laboratories
Curated by ChEMBL
Assay Description
In vitro inhibitory concentration against dog plasma renin at pH 7.4
J Med Chem 36: 460-7 (1993)
BindingDB Entry DOI: 10.7270/Q2VT1R5C
Renin
(Rattus norvegicus)
BDBM50046794
(2-Benzyl-N*1*-[1-(1-cyclohexylmethyl-2,3-dihydroxy...)
Show SMILES CC(C)C[C@H](O)[C@H](O)[C@H](CC1CCCCC1)NC(=O)[C@H](Cc1cscn1)NC(=O)[C@@H](CC(=O)N(C)CCc1ccccn1)Cc1ccccc1
Show InChI InChI=1S/C39H55N5O5S/c1-27(2)20-35(45)37(47)33(22-29-14-8-5-9-15-29)42-39(49)34(24-32-25-50-26-41-32)43-38(48)30(21-28-12-6-4-7-13-28)23-36(46)44(3)19-17-31-16-10-11-18-40-31/h4,6-7,10-13,16,18,25-27,29-30,33-35,37,45,47H,5,8-9,14-15,17,19-24H2,1-3H3,(H,42,49)(H,43,48)/t30-,33+,34+,35+,37-/m1/s1
Reactome pathway
n/an/a>1.00E+4n/an/an/an/a7.4n/a
Abbott Laboratories
Curated by ChEMBL
Assay Description
In vitro inhibitory concentration against rat plasma renin at pH 7.4
J Med Chem 36: 460-7 (1993)
BindingDB Entry DOI: 10.7270/Q2VT1R5C
Renin
(Homo sapiens (Human))
BDBM50046794
(2-Benzyl-N*1*-[1-(1-cyclohexylmethyl-2,3-dihydroxy...)
Show SMILES CC(C)C[C@H](O)[C@H](O)[C@H](CC1CCCCC1)NC(=O)[C@H](Cc1cscn1)NC(=O)[C@@H](CC(=O)N(C)CCc1ccccn1)Cc1ccccc1
Show InChI InChI=1S/C39H55N5O5S/c1-27(2)20-35(45)37(47)33(22-29-14-8-5-9-15-29)42-39(49)34(24-32-25-50-26-41-32)43-38(48)30(21-28-12-6-4-7-13-28)23-36(46)44(3)19-17-31-16-10-11-18-40-31/h4,6-7,10-13,16,18,25-27,29-30,33-35,37,45,47H,5,8-9,14-15,17,19-24H2,1-3H3,(H,42,49)(H,43,48)/t30-,33+,34+,35+,37-/m1/s1
Reactome pathway
n/an/a 0.760n/an/an/an/a7.4n/a
Abbott Laboratories
Curated by ChEMBL
Assay Description
In vitro inhibitory concentration against monkey plasma renin at pH 7.4
J Med Chem 36: 460-7 (1993)
BindingDB Entry DOI: 10.7270/Q2VT1R5C
Renin
(Homo sapiens (Human))
BDBM50046794
(2-Benzyl-N*1*-[1-(1-cyclohexylmethyl-2,3-dihydroxy...)
Show SMILES CC(C)C[C@H](O)[C@H](O)[C@H](CC1CCCCC1)NC(=O)[C@H](Cc1cscn1)NC(=O)[C@@H](CC(=O)N(C)CCc1ccccn1)Cc1ccccc1
Show InChI InChI=1S/C39H55N5O5S/c1-27(2)20-35(45)37(47)33(22-29-14-8-5-9-15-29)42-39(49)34(24-32-25-50-26-41-32)43-38(48)30(21-28-12-6-4-7-13-28)23-36(46)44(3)19-17-31-16-10-11-18-40-31/h4,6-7,10-13,16,18,25-27,29-30,33-35,37,45,47H,5,8-9,14-15,17,19-24H2,1-3H3,(H,42,49)(H,43,48)/t30-,33+,34+,35+,37-/m1/s1
Reactome pathway
n/an/a 2.60n/an/an/an/a7.4n/a
Abbott Laboratories
Curated by ChEMBL
Assay Description
In vitro inhibitory concentration against human plasma renin at pH 7.4
J Med Chem 36: 460-7 (1993)
BindingDB Entry DOI: 10.7270/Q2VT1R5C