BDBM50047676 CHEMBL3319211
SMILES: CN(C)CCCS(=O)(=O)c1ccc2nc(NC(=O)NC(=O)c3ccccc3Cl)sc2c1
InChI Key: InChIKey=TTWGIIOGRZTJNJ-UHFFFAOYSA-N
Data: 1 IC50
Activity Spreadsheet -- Enzyme Inhibition Constant Data from BindingDB
Found 1 hit for monomerid = 50047676
Trg + Lig
Ki
nM
ΔG°
kcal/mole
IC50
nM
Kd
nM
EC50/IC50
nM
koff
s-1
kon
M-1s-1
pHTemp
°C
Ghrelin receptor
(Homo sapiens (Human))
BDBM50047676
(CHEMBL3319211)
Show SMILES CN(C)CCCS(=O)(=O)c1ccc2nc(NC(=O)NC(=O)c3ccccc3Cl)sc2c1
Show InChI InChI=1S/C20H21ClN4O4S2/c1-25(2)10-5-11-31(28,29)13-8-9-16-17(12-13)30-20(22-16)24-19(27)23-18(26)14-6-3-4-7-15(14)21/h3-4,6-9,12H,5,10-11H2,1-2H3,(H2,22,23,24,26,27)
Reactome pathway
n/an/a 8.70n/an/an/an/an/an/a
AstraZeneca
Curated by ChEMBL
Assay Description
Displacement of [125I]human ghrelin from human GHS-R1a expressed in HEK cell membranes after 60 mins by gamma counting method
J Med Chem 57: 6128-40 (2014)
Article DOI: 10.1021/jm500610n
BindingDB Entry DOI: 10.7270/Q279469X