BDBM50049328 CHEMBL134500::LY-303870::N-[1-{[Acetyl-(2-methoxy-benzyl)-amino]-methyl}-2-(1H-indol-3-yl)-ethyl]-2-[1,4']bipiperidinyl-1'-yl-acetamide
SMILES: COc1ccccc1CN(CC(Cc1c[nH]c2ccccc12)NC(=O)CN1CCC(CC1)N1CCCCC1)C(C)=O
InChI Key: InChIKey=CVXJAPZTZWLRBP-UHFFFAOYSA-N
Data: 1 IC50
Activity Spreadsheet -- Enzyme Inhibition Constant Data from BindingDB
Found 1 hit for monomerid = 50049328
Trg + Lig
Ki
nM
ΔG°
kcal/mole
IC50
nM
Kd
nM
EC50/IC50
nM
koff
s-1
kon
M-1s-1
pHTemp
°C
Neurokinin 1 receptor
(Homo sapiens (Human))
BDBM50049328
(CHEMBL134500 | LY-303870 | N-[1-{[Acetyl-(2-methox...)
Show SMILES COc1ccccc1CN(CC(Cc1c[nH]c2ccccc12)NC(=O)CN1CCC(CC1)N1CCCCC1)C(C)=O
Show InChI InChI=1S/C33H45N5O3/c1-25(39)38(22-26-10-4-7-13-32(26)41-2)23-28(20-27-21-34-31-12-6-5-11-30(27)31)35-33(40)24-36-18-14-29(15-19-36)37-16-8-3-9-17-37/h4-7,10-13,21,28-29,34H,3,8-9,14-20,22-24H2,1-2H3,(H,35,40)
Reactome pathway
n/an/a 0.230n/an/an/an/an/an/a
Lilly Research Laboratories
Curated by ChEMBL
Assay Description
Inhibitory activity against Tachykinin receptor 1 in human IM-9 cells using [125I]-labeled Boltan-Hunter substance P as radioligand
J Med Chem 39: 736-48 (1996)
Article DOI: 10.1021/jm950616c
BindingDB Entry DOI: 10.7270/Q20864C7