BDBM50050928 (S)-2-[(R)-4-Methyl-2-((S)-2-{(R)-4-methyl-2-[(S)-3-phenyl-2-(3-m-tolyl-ureido)-propionylamino]-pentanoylamino}-3-phenyl-propionylamino)-pentanoylamino]-3-phenyl-propionic acid::CHEMBL7486
SMILES: CC(C)C[C@@H](NC(=O)[C@H](Cc1ccccc1)NC(=O)[C@@H](CC(C)C)NC(=O)[C@H](Cc1ccccc1)NC(=O)Nc1cccc(C)c1)C(=O)N[C@@H](Cc1ccccc1)C(O)=O
InChI Key: InChIKey=PFLXIZFZAKCLBS-HJRBIJKLSA-N
Data: 2 IC50
Activity Spreadsheet -- Enzyme Inhibition Constant Data from BindingDB
Found 2 hits for monomerid = 50050928
Trg + Lig
Ki
nM
ΔG°
kcal/mole
IC50
nM
Kd
nM
EC50/IC50
nM
koff
s-1
kon
M-1s-1
pHTemp
°C
fMet-Leu-Phe receptor
(Homo sapiens (Human))
BDBM50050928
((S)-2-[(R)-4-Methyl-2-((S)-2-{(R)-4-methyl-2-[(S)-...)
Show SMILES CC(C)C[C@@H](NC(=O)[C@H](Cc1ccccc1)NC(=O)[C@@H](CC(C)C)NC(=O)[C@H](Cc1ccccc1)NC(=O)Nc1cccc(C)c1)C(=O)N[C@@H](Cc1ccccc1)C(O)=O
Show InChI InChI=1S/C47H58N6O7/c1-30(2)24-37(50-45(57)40(28-34-19-11-7-12-20-34)53-47(60)48-36-23-15-16-32(5)26-36)42(54)51-39(27-33-17-9-6-10-18-33)44(56)49-38(25-31(3)4)43(55)52-41(46(58)59)29-35-21-13-8-14-22-35/h6-23,26,30-31,37-41H,24-25,27-29H2,1-5H3,(H,49,56)(H,50,57)(H,51,54)(H,52,55)(H,58,59)(H2,48,53,60)/t37-,38-,39+,40+,41+/m1/s1
Reactome pathway
n/an/a 200n/an/an/an/an/an/a
Johnson Matthey Biomedical Research
Curated by ChEMBL
Assay Description
Binding affinity towards fMLF receptor using human neutrophils
J Med Chem 39: 1013-5 (1996)
Article DOI: 10.1021/jm950908d
BindingDB Entry DOI: 10.7270/Q2TD9WF6
fMet-Leu-Phe receptor
(Homo sapiens (Human))
BDBM50050928
((S)-2-[(R)-4-Methyl-2-((S)-2-{(R)-4-methyl-2-[(S)-...)
Show SMILES CC(C)C[C@@H](NC(=O)[C@H](Cc1ccccc1)NC(=O)[C@@H](CC(C)C)NC(=O)[C@H](Cc1ccccc1)NC(=O)Nc1cccc(C)c1)C(=O)N[C@@H](Cc1ccccc1)C(O)=O
Show InChI InChI=1S/C47H58N6O7/c1-30(2)24-37(50-45(57)40(28-34-19-11-7-12-20-34)53-47(60)48-36-23-15-16-32(5)26-36)42(54)51-39(27-33-17-9-6-10-18-33)44(56)49-38(25-31(3)4)43(55)52-41(46(58)59)29-35-21-13-8-14-22-35/h6-23,26,30-31,37-41H,24-25,27-29H2,1-5H3,(H,49,56)(H,50,57)(H,51,54)(H,52,55)(H,58,59)(H2,48,53,60)/t37-,38-,39+,40+,41+/m1/s1
Reactome pathway
n/an/a 20n/an/an/an/an/an/a
Johnson Matthey Biomedical Research
Curated by ChEMBL
Assay Description
Antagonistic activity was determined by measuring the ability to inhibit superoxide production(stimulated by fMLF) using human neutrophils
J Med Chem 39: 1013-5 (1996)
Article DOI: 10.1021/jm950908d
BindingDB Entry DOI: 10.7270/Q2TD9WF6