BDBM50053315 CHEMBL3330411
SMILES: COc1cc(ccc1Nc1nc(Nc2ccccc2S(=O)(=O)C(C)C)c2cc[nH]c2n1)N1CCC(O)CC1
InChI Key: InChIKey=WRLHYUXLWUWBTK-UHFFFAOYSA-N
Data: 2 IC50
Activity Spreadsheet -- Enzyme Inhibition Constant Data from BindingDB
Found 2 hits for monomerid = 50053315
Trg + Lig
Ki
nM
ΔG°
kcal/mole
IC50
nM
Kd
nM
EC50/IC50
nM
koff
s-1
kon
M-1s-1
pHTemp
°C
Dual specificity protein kinase TTK
(Homo sapiens (Human))
BDBM50053315
(CHEMBL3330411)
Show SMILES COc1cc(ccc1Nc1nc(Nc2ccccc2S(=O)(=O)C(C)C)c2cc[nH]c2n1)N1CCC(O)CC1
Show InChI InChI=1S/C27H32N6O4S/c1-17(2)38(35,36)24-7-5-4-6-22(24)29-26-20-10-13-28-25(20)31-27(32-26)30-21-9-8-18(16-23(21)37-3)33-14-11-19(34)12-15-33/h4-10,13,16-17,19,34H,11-12,14-15H2,1-3H3,(H3,28,29,30,31,32)
n/an/a 809n/an/an/an/an/an/a
The Ohio State University
Curated by ChEMBL
Assay Description
Inhibition of recombinant human GST-tagged Mps1/TTK (507 to 1400 residues) using recombinant cetn2 as substrate in presence of [gamma-32P]ATP measure...
Bioorg Med Chem 25: 2156-2166 (2017)
Article DOI: 10.1016/j.bmc.2017.02.030
BindingDB Entry DOI: 10.7270/Q2571FGM
Dual specificity protein kinase TTK
(Homo sapiens (Human))
BDBM50053315
(CHEMBL3330411)
Show SMILES COc1cc(ccc1Nc1nc(Nc2ccccc2S(=O)(=O)C(C)C)c2cc[nH]c2n1)N1CCC(O)CC1
Show InChI InChI=1S/C27H32N6O4S/c1-17(2)38(35,36)24-7-5-4-6-22(24)29-26-20-10-13-28-25(20)31-27(32-26)30-21-9-8-18(16-23(21)37-3)33-14-11-19(34)12-15-33/h4-10,13,16-17,19,34H,11-12,14-15H2,1-3H3,(H3,28,29,30,31,32)
n/an/a 370n/an/an/an/an/an/a
University Health Network
Curated by ChEMBL
Assay Description
Inhibition of GST-fused full length human TTK compound pre-incubated for 15 mins prior ATP addition by MBP-based assay
Bioorg Med Chem 22: 4968-97 (2014)
Article DOI: 10.1016/j.bmc.2014.06.027
BindingDB Entry DOI: 10.7270/Q2K35WB2