BDBM50055839 CHEMBL3325781
SMILES: CCCC(=O)c1cnn(c1C)-c1ccc(NC(=O)c2cn(CC(=O)N3CCNCC3)c3ccc(C)cc23)cc1
InChI Key: InChIKey=ZJOHCDHMBFDXRZ-UHFFFAOYSA-N
Data: 2 IC50
Activity Spreadsheet -- Enzyme Inhibition Constant Data from BindingDB
Found 2 hits for monomerid = 50055839
Trg + Lig
Ki
nM
ΔG°
kcal/mole
IC50
nM
Kd
nM
EC50/IC50
nM
koff
s-1
kon
M-1s-1
pHTemp
°C
Purinergic receptor P2Y12
(Homo sapiens (Human))
BDBM50055839
(CHEMBL3325781)
Show SMILES CCCC(=O)c1cnn(c1C)-c1ccc(NC(=O)c2cn(CC(=O)N3CCNCC3)c3ccc(C)cc23)cc1
Show InChI InChI=1S/C30H34N6O3/c1-4-5-28(37)25-17-32-36(21(25)3)23-9-7-22(8-10-23)33-30(39)26-18-35(27-11-6-20(2)16-24(26)27)19-29(38)34-14-12-31-13-15-34/h6-11,16-18,31H,4-5,12-15,19H2,1-3H3,(H,33,39)
Reactome pathway
n/an/a 26n/an/an/an/an/an/a
Sanofi R&D
Curated by ChEMBL
Assay Description
Displacement of [33P]2MeS-ADP from P2Y12 receptor (unknown origin) transfected in CHO cells after 30 mins by scintillation counting analysis
J Med Chem 57: 7293-316 (2014)
Article DOI: 10.1021/jm500588w
BindingDB Entry DOI: 10.7270/Q2D79D21
Purinergic receptor P2Y12
(Rattus norvegicus)
BDBM50055839
(CHEMBL3325781)
Show SMILES CCCC(=O)c1cnn(c1C)-c1ccc(NC(=O)c2cn(CC(=O)N3CCNCC3)c3ccc(C)cc23)cc1
Show InChI InChI=1S/C30H34N6O3/c1-4-5-28(37)25-17-32-36(21(25)3)23-9-7-22(8-10-23)33-30(39)26-18-35(27-11-6-20(2)16-24(26)27)19-29(38)34-14-12-31-13-15-34/h6-11,16-18,31H,4-5,12-15,19H2,1-3H3,(H,33,39)
Reactome pathway
n/an/a 1.00E+3n/an/an/an/an/an/a
Sanofi R&D
Curated by ChEMBL
Assay Description
Antagonist activity at P2Y12 receptor in Sprague-Dawley rat platelet rich plasma assessed as inhibition of ADP-induced aggregation
J Med Chem 57: 7293-316 (2014)
Article DOI: 10.1021/jm500588w
BindingDB Entry DOI: 10.7270/Q2D79D21