BDBM50055920 CHEMBL3321915
SMILES: COc1ccc(CC(=O)NC(=N)NCc2ccc(C)cc2)cc1OC
InChI Key: InChIKey=LDSKOSCPBKZJCO-UHFFFAOYSA-N
Data: 2 IC50
PDB links: 1 PDB ID matches this monomer.
Activity Spreadsheet -- Enzyme Inhibition Constant Data from BindingDB
Found 2 hits for monomerid = 50055920
Trg + Lig
Ki
nM
ΔG°
kcal/mole
IC50
nM
Kd
nM
EC50/IC50
nM
koff
s-1
kon
M-1s-1
pHTemp
°C
Cathepsin D
(Homo sapiens (Human))
BDBM50055920
(CHEMBL3321915)
Show SMILES COc1ccc(CC(=O)NC(=N)NCc2ccc(C)cc2)cc1OC
Show InChI InChI=1S/C19H23N3O3/c1-13-4-6-14(7-5-13)12-21-19(20)22-18(23)11-15-8-9-16(24-2)17(10-15)25-3/h4-10H,11-12H2,1-3H3,(H3,20,21,22,23)
NCI pathway
Reactome pathway
n/an/a 1.90E+3n/an/an/an/an/an/a
Merck KGaA
Curated by ChEMBL
Assay Description
Inhibition of human liver cathepsin D using MCA-labeled GKPILFFRLK(Dnp)-D-R-NH2 peptide by fluorescence-based assay
Bioorg Med Chem Lett 24: 4141-50 (2014)
Article DOI: 10.1016/j.bmcl.2014.07.054
BindingDB Entry DOI: 10.7270/Q2W95BV1
3D
3D Structure (crystal)
Renin
(Homo sapiens (Human))
BDBM50055920
(CHEMBL3321915)
Show SMILES COc1ccc(CC(=O)NC(=N)NCc2ccc(C)cc2)cc1OC
Show InChI InChI=1S/C19H23N3O3/c1-13-4-6-14(7-5-13)12-21-19(20)22-18(23)11-15-8-9-16(24-2)17(10-15)25-3/h4-10H,11-12H2,1-3H3,(H3,20,21,22,23)
Reactome pathway
n/an/a>3.00E+4n/an/an/an/an/an/a
Merck KGaA
Curated by ChEMBL
Assay Description
Inhibition of human recombinant renin using quenched Dabcyl-g-Abu-IHPFHLVIHT-Edans peptide substrate by fluorescence-based assay
Bioorg Med Chem Lett 24: 4141-50 (2014)
Article DOI: 10.1016/j.bmcl.2014.07.054
BindingDB Entry DOI: 10.7270/Q2W95BV1