BDBM50057647 CHEMBL3326458
SMILES: [H][C@@]12[C@H](O)CCN1N=C([C@H]2OC)c1ccc(C#N)c(Cl)c1C
InChI Key: InChIKey=RJZJEPYCJHLWQR-BYCMXARLSA-N
Data: 1 EC50
Activity Spreadsheet -- Enzyme Inhibition Constant Data from BindingDB
Found 1 hit for monomerid = 50057647
Trg + Lig
Ki
nM
ΔG°
kcal/mole
IC50
nM
Kd
nM
EC50/IC50
nM
koff
s-1
kon
M-1s-1
pHTemp
°C
Androgen Receptor
(Homo sapiens (Human))
BDBM50057647
(CHEMBL3326458)
Show SMILES [H][C@@]12[C@H](O)CCN1N=C([C@H]2OC)c1ccc(C#N)c(Cl)c1C |r,c:8|
Show InChI InChI=1S/C15H16ClN3O2/c1-8-10(4-3-9(7-17)12(8)16)13-15(21-2)14-11(20)5-6-19(14)18-13/h3-4,11,14-15,20H,5-6H2,1-2H3/t11-,14+,15-/m1/s1
NCI pathway
Reactome pathway
n/an/an/an/a 0.400n/an/an/an/a
Novartis Institutes for BioMedical Research
Curated by ChEMBL
Assay Description
Agonist activity at human androgen receptor expressed in mouse C2C12 cells by androgen-specific response element-driven luciferase reporter gene assa...
J Med Chem 57: 7396-411 (2014)
Article DOI: 10.1021/jm5009049
BindingDB Entry DOI: 10.7270/Q2RB768M