BDBM50057796 CHEMBL3326188
SMILES: CCCCCc1ccc(cc1)-c1ccoc1C(=O)NNC(=O)c1ccc(O)c(c1)[N+]([O-])=O
InChI Key: InChIKey=XOVVMEVNXYGYEG-UHFFFAOYSA-N
Data: 5 IC50
Activity Spreadsheet -- Enzyme Inhibition Constant Data from BindingDB
Found 5 hits for monomerid = 50057796
Trg + Lig
Ki
nM
ΔG°
kcal/mole
IC50
nM
Kd
nM
EC50/IC50
nM
koff
s-1
kon
M-1s-1
pHTemp
°C
Glucagon receptor
(Rattus norvegicus)
BDBM50057796
(CHEMBL3326188)
Show SMILES CCCCCc1ccc(cc1)-c1ccoc1C(=O)NNC(=O)c1ccc(O)c(c1)[N+]([O-])=O
Show InChI InChI=1S/C23H23N3O6/c1-2-3-4-5-15-6-8-16(9-7-15)18-12-13-32-21(18)23(29)25-24-22(28)17-10-11-20(27)19(14-17)26(30)31/h6-14,27H,2-5H2,1H3,(H,24,28)(H,25,29)
Reactome pathway
n/an/a 9.60E+3n/an/an/an/an/an/a
Dainippon Sumitomo Pharma. Co. Ltd
Curated by ChEMBL
Assay Description
Displacement of [125I]glucagon from glucagon receptor in rat hepatocyte membranes after 30 mins by gamma-counting
Bioorg Med Chem Lett 24: 4266-70 (2014)
Article DOI: 10.1016/j.bmcl.2014.07.025
BindingDB Entry DOI: 10.7270/Q2ZW1NK4
Glucagon receptor
(Rattus norvegicus)
BDBM50057796
(CHEMBL3326188)
Show SMILES CCCCCc1ccc(cc1)-c1ccoc1C(=O)NNC(=O)c1ccc(O)c(c1)[N+]([O-])=O
Show InChI InChI=1S/C23H23N3O6/c1-2-3-4-5-15-6-8-16(9-7-15)18-12-13-32-21(18)23(29)25-24-22(28)17-10-11-20(27)19(14-17)26(30)31/h6-14,27H,2-5H2,1H3,(H,24,28)(H,25,29)
Reactome pathway
n/an/a 5.30n/an/an/an/an/an/a
Dainippon Sumitomo Pharma. Co. Ltd
Curated by ChEMBL
Assay Description
Inhibition of glucagon-induced glucagon receptor-mediated cAMP production in rat hepatocytes after 15 mins by cAMP dynamic2 assay
Bioorg Med Chem Lett 24: 4266-70 (2014)
Article DOI: 10.1016/j.bmcl.2014.07.025
BindingDB Entry DOI: 10.7270/Q2ZW1NK4
Potassium voltage-gated channel subfamily H member 2
(Homo sapiens (Human))
BDBM50057796
(CHEMBL3326188)
Show SMILES CCCCCc1ccc(cc1)-c1ccoc1C(=O)NNC(=O)c1ccc(O)c(c1)[N+]([O-])=O
Show InChI InChI=1S/C23H23N3O6/c1-2-3-4-5-15-6-8-16(9-7-15)18-12-13-32-21(18)23(29)25-24-22(28)17-10-11-20(27)19(14-17)26(30)31/h6-14,27H,2-5H2,1H3,(H,24,28)(H,25,29)
Reactome pathway
n/an/a>1.00E+3n/an/an/an/an/an/a
Dainippon Sumitomo Pharma. Co. Ltd
Curated by ChEMBL
Assay Description
Inhibition of human ERG
Bioorg Med Chem Lett 24: 4266-70 (2014)
Article DOI: 10.1016/j.bmcl.2014.07.025
BindingDB Entry DOI: 10.7270/Q2ZW1NK4
Glucagon-like peptide 1 receptor (GLP-1)
(Homo sapiens (Human))
BDBM50057796
(CHEMBL3326188)
Show SMILES CCCCCc1ccc(cc1)-c1ccoc1C(=O)NNC(=O)c1ccc(O)c(c1)[N+]([O-])=O
Show InChI InChI=1S/C23H23N3O6/c1-2-3-4-5-15-6-8-16(9-7-15)18-12-13-32-21(18)23(29)25-24-22(28)17-10-11-20(27)19(14-17)26(30)31/h6-14,27H,2-5H2,1H3,(H,24,28)(H,25,29)
n/an/a>1.00E+3n/an/an/an/an/an/a
Dainippon Sumitomo Pharma. Co. Ltd
Curated by ChEMBL
Assay Description
Inhibition of GLP-1R (unknown origin)
Bioorg Med Chem Lett 24: 4266-70 (2014)
Article DOI: 10.1016/j.bmcl.2014.07.025
BindingDB Entry DOI: 10.7270/Q2ZW1NK4
Glucagon receptor
(Homo sapiens (Human))
BDBM50057796
(CHEMBL3326188)
Show SMILES CCCCCc1ccc(cc1)-c1ccoc1C(=O)NNC(=O)c1ccc(O)c(c1)[N+]([O-])=O
Show InChI InChI=1S/C23H23N3O6/c1-2-3-4-5-15-6-8-16(9-7-15)18-12-13-32-21(18)23(29)25-24-22(28)17-10-11-20(27)19(14-17)26(30)31/h6-14,27H,2-5H2,1H3,(H,24,28)(H,25,29)
n/an/a 292n/an/an/an/an/an/a
Dainippon Sumitomo Pharma. Co. Ltd
Curated by ChEMBL
Assay Description
Inhibition of glucagon-induced glucagon receptor-mediated cAMP production in human hepatocytes after 15 mins by cAMP dynamic2 assay
Bioorg Med Chem Lett 24: 4266-70 (2014)
Article DOI: 10.1016/j.bmcl.2014.07.025
BindingDB Entry DOI: 10.7270/Q2ZW1NK4