BDBM50060702 CHEMBL3394711
SMILES: COc1cc2CCN3C(CCC3=O)c2c(OC)c1
InChI Key: InChIKey=KHTWOVBNKKCXDV-UHFFFAOYSA-N
Data: 1 IC50
Activity Spreadsheet -- Enzyme Inhibition Constant Data from BindingDB
Found 1 hit for monomerid = 50060702
Trg + Lig
Ki
nM
ΔG°
kcal/mole
IC50
nM
Kd
nM
EC50/IC50
nM
koff
s-1
kon
M-1s-1
pHTemp
°C
Poly [ADP-ribose] polymerase 1
(Homo sapiens (Human))
BDBM50060702
(CHEMBL3394711)
Show SMILES COc1cc2CCN3C(CCC3=O)c2c(OC)c1
Show InChI InChI=1S/C14H17NO3/c1-17-10-7-9-5-6-15-11(3-4-13(15)16)14(9)12(8-10)18-2/h7-8,11H,3-6H2,1-2H3
n/an/a 1.37E+3n/an/an/an/an/an/a
Pondicherry University
Curated by ChEMBL
Assay Description
Inhibition of PARP1 (unknown origin) in presence of NAD+ by homogenous fluorescence plate assay
Bioorg Med Chem 23: 488-98 (2015)
Article DOI: 10.1016/j.bmc.2014.12.017
BindingDB Entry DOI: 10.7270/Q2BV7J9N