BDBM50061276 (R)-1-[(R)-2-(Adamantan-2-yloxycarbonylamino)-3-(1H-indol-3-yl)-2-methyl-propionyl]-4-(4-chloro-phenyl)-pyrrolidine-2-carboxylic acid::CHEMBL338526
SMILES:
InChI Key: InChIKey=PEQILDCMULERGE-GONNHNTPSA-N
Data: 2 KI  1 IC50
Activity Spreadsheet -- Enzyme Inhibition Constant Data from BindingDB
Found 3 hits for monomerid = 50061276
Trg + Lig
Ki
nM
ΔG°
kcal/mole
IC50
nM
Kd
nM
EC50/IC50
nM
koff
s-1
kon
M-1s-1
pHTemp
°C
Cholecystokinin receptor
(Homo sapiens (Human))
BDBM50061276
((R)-1-[(R)-2-(Adamantan-2-yloxycarbonylamino)-3-(1...)
Show InChI InChI=1S/C34H38ClN3O5/c1-34(16-25-17-36-28-5-3-2-4-27(25)28,37-33(42)43-30-22-11-19-10-20(13-22)14-23(30)12-19)32(41)38-18-24(15-29(38)31(39)40)21-6-8-26(35)9-7-21/h2-9,17,19-20,22-24,29-30,36H,10-16,18H2,1H3,(H,37,42)(H,39,40)/t19-,20+,22-,23+,24?,29-,30?,34-/m1/s1
Reactome pathway
6.10n/an/an/an/an/an/an/an/a
INSERM
Curated by ChEMBL
Assay Description
Compound was tested for the affinity against Cholecystokinin type B receptor on guinea pig cortex.
J Med Chem 40: 3947-56 (1998)
Article DOI: 10.1021/jm970439a
BindingDB Entry DOI: 10.7270/Q27H1K8Z
CCKBR
(RAT)
BDBM50061276
((R)-1-[(R)-2-(Adamantan-2-yloxycarbonylamino)-3-(1...)
Show InChI InChI=1S/C34H38ClN3O5/c1-34(16-25-17-36-28-5-3-2-4-27(25)28,37-33(42)43-30-22-11-19-10-20(13-22)14-23(30)12-19)32(41)38-18-24(15-29(38)31(39)40)21-6-8-26(35)9-7-21/h2-9,17,19-20,22-24,29-30,36H,10-16,18H2,1H3,(H,37,42)(H,39,40)/t19-,20+,22-,23+,24?,29-,30?,34-/m1/s1
14n/an/an/an/an/an/an/an/a
INSERM
Curated by ChEMBL
Assay Description
Compounds were tested for binding affinity against rat brain Cholecystokinin type B receptor expressed in CHO cells.
J Med Chem 40: 3947-56 (1998)
Article DOI: 10.1021/jm970439a
BindingDB Entry DOI: 10.7270/Q27H1K8Z
CCKBR
(RAT)
BDBM50061276
((R)-1-[(R)-2-(Adamantan-2-yloxycarbonylamino)-3-(1...)
Show InChI InChI=1S/C34H38ClN3O5/c1-34(16-25-17-36-28-5-3-2-4-27(25)28,37-33(42)43-30-22-11-19-10-20(13-22)14-23(30)12-19)32(41)38-18-24(15-29(38)31(39)40)21-6-8-26(35)9-7-21/h2-9,17,19-20,22-24,29-30,36H,10-16,18H2,1H3,(H,37,42)(H,39,40)/t19-,20+,22-,23+,24?,29-,30?,34-/m1/s1
n/an/a 217n/an/an/an/an/an/a
INSERM
Curated by ChEMBL
Assay Description
Inhibition of inositol phosphate production induced by Cholecystokinin type B receptor (0.5 nM)
J Med Chem 40: 3947-56 (1998)
Article DOI: 10.1021/jm970439a
BindingDB Entry DOI: 10.7270/Q27H1K8Z