BDBM50062651 3-[(2-Chloro-4-trifluoromethyl-pyrimidine-5-carbonyl)-amino]-5-trifluoromethyl-benzoic acid cyclohexyl ester::CHEMBL133940
SMILES: FC(F)(F)c1cc(NC(=O)c2cnc(Cl)nc2C(F)(F)F)cc(c1)C(=O)OC1CCCCC1
InChI Key: InChIKey=VIBQBHLRZGBOKM-UHFFFAOYSA-N
Data: 2 IC50
Activity Spreadsheet -- Enzyme Inhibition Constant Data from BindingDB
Found 2 hits for monomerid = 50062651
Trg + Lig
Ki
nM
ΔG°
kcal/mole
IC50
nM
Kd
nM
EC50/IC50
nM
koff
s-1
kon
M-1s-1
pHTemp
°C
Activating transcription factor 1
(Homo sapiens (Human))
BDBM50062651
(3-[(2-Chloro-4-trifluoromethyl-pyrimidine-5-carbon...)
Show SMILES FC(F)(F)c1cc(NC(=O)c2cnc(Cl)nc2C(F)(F)F)cc(c1)C(=O)OC1CCCCC1
Show InChI InChI=1S/C20H16ClF6N3O3/c21-18-28-9-14(15(30-18)20(25,26)27)16(31)29-12-7-10(6-11(8-12)19(22,23)24)17(32)33-13-4-2-1-3-5-13/h6-9,13H,1-5H2,(H,29,31)
NCI pathway
Reactome pathway
n/an/a 1.20E+3n/an/an/an/an/an/a
Signal Pharmaceuticals, Inc.
Curated by ChEMBL
Assay Description
In vitro inhibitory activity against human Jurkat T-Cells stably transfected with activating transcription factor 1
J Med Chem 41: 413-9 (1998)
Article DOI: 10.1021/jm970671g
BindingDB Entry DOI: 10.7270/Q2P55MMZ
Nuclear factor NF-kappa-B (NF-kB)
(Homo sapiens (Human))
BDBM50062651
(3-[(2-Chloro-4-trifluoromethyl-pyrimidine-5-carbon...)
Show SMILES FC(F)(F)c1cc(NC(=O)c2cnc(Cl)nc2C(F)(F)F)cc(c1)C(=O)OC1CCCCC1
Show InChI InChI=1S/C20H16ClF6N3O3/c21-18-28-9-14(15(30-18)20(25,26)27)16(31)29-12-7-10(6-11(8-12)19(22,23)24)17(32)33-13-4-2-1-3-5-13/h6-9,13H,1-5H2,(H,29,31)
n/an/a 1.80E+3n/an/an/an/an/an/a
Signal Pharmaceuticals, Inc.
Curated by ChEMBL
Assay Description
In vitro inhibitory activity against human Jurkat T-Cells stably transfected with an Nuclear factor kappa B transcription factor
J Med Chem 41: 413-9 (1998)
Article DOI: 10.1021/jm970671g
BindingDB Entry DOI: 10.7270/Q2P55MMZ