BDBM50063050 CHEMBL3398145
SMILES: CCCC(=O)c1ccccc1NS(=O)(=O)c1ccc(OC(=O)C(C)(C)C)cc1
InChI Key: InChIKey=CPJZBAKYBNKFMF-UHFFFAOYSA-N
Data: 3 IC50
Activity Spreadsheet -- Enzyme Inhibition Constant Data from BindingDB
Found 3 hits for monomerid = 50063050
Trg + Lig
Ki
nM
ΔG°
kcal/mole
IC50
nM
Kd
nM
EC50/IC50
nM
koff
s-1
kon
M-1s-1
pHTemp
°C
Leukocyte elastase
(Homo sapiens (Human))
BDBM50063050
(CHEMBL3398145)
Show SMILES CCCC(=O)c1ccccc1NS(=O)(=O)c1ccc(OC(=O)C(C)(C)C)cc1
Show InChI InChI=1S/C21H25NO5S/c1-5-8-19(23)17-9-6-7-10-18(17)22-28(25,26)16-13-11-15(12-14-16)27-20(24)21(2,3)4/h6-7,9-14,22H,5,8H2,1-4H3
Reactome pathway
n/an/a 37n/an/an/an/an/an/a
Chang Gung University
Curated by ChEMBL
Assay Description
Inhibition of Pr3 (unknown origin) using t-butyloxycarbonyl-Ala-Ala-Nva-thiobenzyl ester as substrate measured for 180 mins by spectrophotometry
Bioorg Med Chem 23: 1123-34 (2015)
Article DOI: 10.1016/j.bmc.2014.12.056
BindingDB Entry DOI: 10.7270/Q2CJ8G5M
Cathepsin G
(Homo sapiens (Human))
BDBM50063050
(CHEMBL3398145)
Show SMILES CCCC(=O)c1ccccc1NS(=O)(=O)c1ccc(OC(=O)C(C)(C)C)cc1
Show InChI InChI=1S/C21H25NO5S/c1-5-8-19(23)17-9-6-7-10-18(17)22-28(25,26)16-13-11-15(12-14-16)27-20(24)21(2,3)4/h6-7,9-14,22H,5,8H2,1-4H3
NCI pathway
Reactome pathway
n/an/a>1n/an/an/an/an/an/a
Chang Gung University
Curated by ChEMBL
Assay Description
Inhibition of human cathepsin G using N-succinyl-Ala-Ala-Pro-Phe-p-nitroanilide as substrate measured for 180 mins by spectrophotometry
Bioorg Med Chem 23: 1123-34 (2015)
Article DOI: 10.1016/j.bmc.2014.12.056
BindingDB Entry DOI: 10.7270/Q2CJ8G5M
Leukocyte proteinase 3
(Homo sapiens (Human))
BDBM50063050
(CHEMBL3398145)
Show SMILES CCCC(=O)c1ccccc1NS(=O)(=O)c1ccc(OC(=O)C(C)(C)C)cc1
Show InChI InChI=1S/C21H25NO5S/c1-5-8-19(23)17-9-6-7-10-18(17)22-28(25,26)16-13-11-15(12-14-16)27-20(24)21(2,3)4/h6-7,9-14,22H,5,8H2,1-4H3
NCI pathway
Reactome pathway
n/an/a 36n/an/an/an/an/an/a
Chang Gung University
Curated by ChEMBL
Assay Description
Inhibition of Pr3 (unknown origin) using t-butyloxycarbonyl-Ala-Ala-Nva-thiobenzyl ester as substrate measured for 180 mins by spectrophotometry
Bioorg Med Chem 23: 1123-34 (2015)
Article DOI: 10.1016/j.bmc.2014.12.056
BindingDB Entry DOI: 10.7270/Q2CJ8G5M