BDBM50064640 CHEMBL3403753
SMILES: COc1cc(OC)c(cn1)-c1cnc2[nH]c(cc2c1)-c1c(F)cccc1Cl
InChI Key: InChIKey=LGHQYQBHWZQKIB-UHFFFAOYSA-N
Data: 1 IC50
Activity Spreadsheet -- Enzyme Inhibition Constant Data from BindingDB
Found 1 hit for monomerid = 50064640
Trg + Lig
Ki
nM
ΔG°
kcal/mole
IC50
nM
Kd
nM
EC50/IC50
nM
koff
s-1
kon
M-1s-1
pHTemp
°C
Calcium release-activated calcium channel
(Homo sapiens (Human))
BDBM50064640
(CHEMBL3403753)
Show SMILES COc1cc(OC)c(cn1)-c1cnc2[nH]c(cc2c1)-c1c(F)cccc1Cl
Show InChI InChI=1S/C20H15ClFN3O2/c1-26-17-8-18(27-2)23-10-13(17)12-6-11-7-16(25-20(11)24-9-12)19-14(21)4-3-5-15(19)22/h3-10H,1-2H3,(H,24,25)
n/an/a 440n/an/an/an/an/an/a
Rhône-Poulenc Rorer
Curated by ChEMBL
Assay Description
Inhibition of human Orai1/STIM1 expressed in HEK293 cells assessed as inhibition of channel-mediated calcium current by electrophysiology assay in pr...
Bioorg Med Chem Lett 25: 1217-22 (2015)
Article DOI: 10.1016/j.bmcl.2015.01.063
BindingDB Entry DOI: 10.7270/Q2KW5HQC