BDBM50064888 3',5-dihydroxy-3,4',7-trimethoxyflavone::5-hydroxy-2-(3-hydroxy-4-methoxyphenyl)-3,7-dimethoxy-4H-chromen-4-one::CHEMBL74898
SMILES: COc1cc(O)c2c(c1)oc(-c1ccc(OC)c(O)c1)c(OC)c2=O
InChI Key: InChIKey=KPCRYSMUMBNTCK-UHFFFAOYSA-N
Data: 5 IC50
Activity Spreadsheet -- Enzyme Inhibition Constant Data from BindingDB
Found 5 hits for monomerid = 50064888
Trg + Lig
Ki
nM
ΔG°
kcal/mole
IC50
nM
Kd
nM
EC50/IC50
nM
koff
s-1
kon
M-1s-1
pHTemp
°C
Multidrug resistance protein 1/Multidrug resistance associated protein 1
(Homo sapiens (Human))
BDBM50064888
(3',5-dihydroxy-3,4',7-trimethoxyflavone | 5-hydrox...)
Show SMILES COc1cc(O)c2c(c1)oc(-c1ccc(OC)c(O)c1)c(OC)c2=O
Show InChI InChI=1S/C18H16O7/c1-22-10-7-12(20)15-14(8-10)25-17(18(24-3)16(15)21)9-4-5-13(23-2)11(19)6-9/h4-8,19-20H,1-3H3
n/an/a 5.00E+4n/an/an/an/an/an/a
University of Bonn
Curated by ChEMBL
Assay Description
Inhibition of MRP1 expressed in human 2008 cells assessed as calcein AM accumulation by cell based assay
Bioorg Med Chem 19: 2090-102 (2011)
Article DOI: 10.1016/j.bmc.2010.12.043
BindingDB Entry DOI: 10.7270/Q2PZ593F
ATP-binding cassette sub-family G member 2
(Homo sapiens (Human))
BDBM50064888
(3',5-dihydroxy-3,4',7-trimethoxyflavone | 5-hydrox...)
Show SMILES COc1cc(O)c2c(c1)oc(-c1ccc(OC)c(O)c1)c(OC)c2=O
Show InChI InChI=1S/C18H16O7/c1-22-10-7-12(20)15-14(8-10)25-17(18(24-3)16(15)21)9-4-5-13(23-2)11(19)6-9/h4-8,19-20H,1-3H3
NCI pathway
Reactome pathway
n/an/a 680n/an/an/an/an/an/a
University of Bonn
Curated by ChEMBL
Assay Description
Inhibition of BCRP expressed in MCF-7 MX cells using Hoechst 33342 staining
Bioorg Med Chem 19: 2090-102 (2011)
Article DOI: 10.1016/j.bmc.2010.12.043
BindingDB Entry DOI: 10.7270/Q2PZ593F
ATP-binding cassette sub-family G member 2
(Homo sapiens (Human))
BDBM50064888
(3',5-dihydroxy-3,4',7-trimethoxyflavone | 5-hydrox...)
Show SMILES COc1cc(O)c2c(c1)oc(-c1ccc(OC)c(O)c1)c(OC)c2=O
Show InChI InChI=1S/C18H16O7/c1-22-10-7-12(20)15-14(8-10)25-17(18(24-3)16(15)21)9-4-5-13(23-2)11(19)6-9/h4-8,19-20H,1-3H3
NCI pathway
Reactome pathway
n/an/a 5.70E+3n/an/an/an/an/an/a
Center for Cancer Research, NCI-Frederick
Curated by ChEMBL
Assay Description
Inhibition of ABCG2 expressed in human NCI-H460 cells assessed as inhibition of PhA accumulation after 2 to 20 hrs relative to fumitremorgin C
J Nat Prod 74: 262-6 (2011)
Article DOI: 10.1021/np100797y
BindingDB Entry DOI: 10.7270/Q2VM4CJT
P-glycoprotein 1
(Homo sapiens (Human))
BDBM50064888
(3',5-dihydroxy-3,4',7-trimethoxyflavone | 5-hydrox...)
Show SMILES COc1cc(O)c2c(c1)oc(-c1ccc(OC)c(O)c1)c(OC)c2=O
Show InChI InChI=1S/C18H16O7/c1-22-10-7-12(20)15-14(8-10)25-17(18(24-3)16(15)21)9-4-5-13(23-2)11(19)6-9/h4-8,19-20H,1-3H3
n/an/a 1.30E+4n/an/an/an/an/an/a
University of Bonn
Curated by ChEMBL
Assay Description
Inhibition of MDR1 expressed in MDCK cells using rhodamine 123 staining by flow cytometry
Bioorg Med Chem 19: 2090-102 (2011)
Article DOI: 10.1016/j.bmc.2010.12.043
BindingDB Entry DOI: 10.7270/Q2PZ593F
ATP-binding cassette sub-family G member 2
(Homo sapiens (Human))
BDBM50064888
(3',5-dihydroxy-3,4',7-trimethoxyflavone | 5-hydrox...)
Show SMILES COc1cc(O)c2c(c1)oc(-c1ccc(OC)c(O)c1)c(OC)c2=O
Show InChI InChI=1S/C18H16O7/c1-22-10-7-12(20)15-14(8-10)25-17(18(24-3)16(15)21)9-4-5-13(23-2)11(19)6-9/h4-8,19-20H,1-3H3
NCI pathway
Reactome pathway
n/an/a 460n/an/an/an/an/an/a
University of Bonn
Curated by ChEMBL
Assay Description
Inhibition of BCRP expressed in MDCK cells using Hoechst 33342 staining
Bioorg Med Chem 19: 2090-102 (2011)
Article DOI: 10.1016/j.bmc.2010.12.043
BindingDB Entry DOI: 10.7270/Q2PZ593F