BDBM50065123 CHEMBL420031::N-[4-(5H,11H-Benzo[e]pyrrolo[1,2-a][1,4]diazepine-10-carbonyl)-3-chloro-phenyl]-2-chloro-4-fluoro-benzamide
SMILES: Fc1ccc(C(=O)Nc2ccc(C(=O)N3Cc4cccn4Cc4ccccc34)c(Cl)c2)c(Cl)c1
InChI Key: InChIKey=MGZAEJXRAJXGQL-UHFFFAOYSA-N
Data: 2 IC50
Activity Spreadsheet -- Enzyme Inhibition Constant Data from BindingDB
Found 2 hits for monomerid = 50065123
Trg + Lig
Ki
nM
ΔG°
kcal/mole
IC50
nM
Kd
nM
EC50/IC50
nM
koff
s-1
kon
M-1s-1
pHTemp
°C
Vasopressin V1a receptor
(Homo sapiens (Human))
BDBM50065123
(CHEMBL420031 | N-[4-(5H,11H-Benzo[e]pyrrolo[1,2-a]...)
Show SMILES Fc1ccc(C(=O)Nc2ccc(C(=O)N3Cc4cccn4Cc4ccccc34)c(Cl)c2)c(Cl)c1
Show InChI InChI=1S/C26H18Cl2FN3O2/c27-22-12-17(29)7-9-20(22)25(33)30-18-8-10-21(23(28)13-18)26(34)32-15-19-5-3-11-31(19)14-16-4-1-2-6-24(16)32/h1-13H,14-15H2,(H,30,33)
n/an/a 37n/an/an/an/an/an/a
Wyeth-Ayerst Research
Curated by ChEMBL
Assay Description
Displacement of [3H]-AVP from vasopressin receptor (V1a) from human platelet membranes.
J Med Chem 41: 2442-4 (1998)
Article DOI: 10.1021/jm980179c
BindingDB Entry DOI: 10.7270/Q2CC0ZT5
Vasopressin V2 receptor
(Homo sapiens (Human))
BDBM50065123
(CHEMBL420031 | N-[4-(5H,11H-Benzo[e]pyrrolo[1,2-a]...)
Show SMILES Fc1ccc(C(=O)Nc2ccc(C(=O)N3Cc4cccn4Cc4ccccc34)c(Cl)c2)c(Cl)c1
Show InChI InChI=1S/C26H18Cl2FN3O2/c27-22-12-17(29)7-9-20(22)25(33)30-18-8-10-21(23(28)13-18)26(34)32-15-19-5-3-11-31(19)14-16-4-1-2-6-24(16)32/h1-13H,14-15H2,(H,30,33)
n/an/a 0.700n/an/an/an/an/an/a
Wyeth-Ayerst Research
Curated by ChEMBL
Assay Description
Displacement of [3H]-AVP from human V2 receptor expressed in murine fibroblast cell line (LV2) membranes
J Med Chem 41: 2442-4 (1998)
Article DOI: 10.1021/jm980179c
BindingDB Entry DOI: 10.7270/Q2CC0ZT5