BDBM50065250 CHEMBL3403832
SMILES: CS(=O)(=O)Nc1cc(NCCO)nc(SCc2ccccc2)n1
InChI Key: InChIKey=KLMUXKIBYQNOCD-UHFFFAOYSA-N
Data: 1 IC50
Activity Spreadsheet -- Enzyme Inhibition Constant Data from BindingDB
Found 1 hit for monomerid = 50065250
Trg + Lig
Ki
nM
ΔG°
kcal/mole
IC50
nM
Kd
nM
EC50/IC50
nM
koff
s-1
kon
M-1s-1
pHTemp
°C
C-X-C chemokine receptor type 2
(Homo sapiens (Human))
BDBM50065250
(CHEMBL3403832)
Show SMILES CS(=O)(=O)Nc1cc(NCCO)nc(SCc2ccccc2)n1
Show InChI InChI=1S/C14H18N4O3S2/c1-23(20,21)18-13-9-12(15-7-8-19)16-14(17-13)22-10-11-5-3-2-4-6-11/h2-6,9,19H,7-8,10H2,1H3,(H2,15,16,17,18)
Reactome pathway
n/an/a 3.16E+3n/an/an/an/an/an/a
AstraZeneca
Curated by ChEMBL
Assay Description
Displacement of [125I]IL-8 from human recombinant CXCR2 receptor expressed in HEK293 cells by scintillation counting analysis
Bioorg Med Chem Lett 25: 1616-20 (2015)
Article DOI: 10.1016/j.bmcl.2015.01.067
BindingDB Entry DOI: 10.7270/Q2F47QT4