BDBM50066204 (S)-1-(2-Bromo-benzylthiocarbamoyl)-pyrrolidine-2-carboxylic acid [(S)-1-(benzyl-methyl-carbamoyl)-2-phenyl-ethyl]-amide::CHEMBL323274
SMILES: CN(Cc1ccccc1)C(=O)[C@H](Cc1ccccc1)NC(=O)[C@@H]1CCCN1C(=S)NCc1ccccc1Br
InChI Key: InChIKey=QEKNOTIEZRQEFJ-SVBPBHIXSA-N
Data: 1 KI
Activity Spreadsheet -- Enzyme Inhibition Constant Data from BindingDB
Found 1 hit for monomerid = 50066204
Trg + Lig
Ki
nM
ΔG°
kcal/mole
IC50
nM
Kd
nM
EC50/IC50
nM
koff
s-1
kon
M-1s-1
pHTemp
°C
Substance-P receptor
(Homo sapiens (Human))
BDBM50066204
((S)-1-(2-Bromo-benzylthiocarbamoyl)-pyrrolidine-2-...)
Show SMILES CN(Cc1ccccc1)C(=O)[C@H](Cc1ccccc1)NC(=O)[C@@H]1CCCN1C(=S)NCc1ccccc1Br
Show InChI InChI=1S/C30H33BrN4O2S/c1-34(21-23-13-6-3-7-14-23)29(37)26(19-22-11-4-2-5-12-22)33-28(36)27-17-10-18-35(27)30(38)32-20-24-15-8-9-16-25(24)31/h2-9,11-16,26-27H,10,17-21H2,1H3,(H,32,38)(H,33,36)/t26-,27-/m0/s1
Reactome pathway
30n/an/an/an/an/an/an/an/a
Novartis Institute for Medical Sciences
Curated by ChEMBL
Assay Description
In vitro binding affinity towards Tachykinin receptor 1 by measuring its ability to displace [3H]SP (0.6 nM) binding to membranes from Cos-7 cells tr...
J Med Chem 41: 3159-73 (1998)
Article DOI: 10.1021/jm970499g
BindingDB Entry DOI: 10.7270/Q2BZ66QJ