BDBM50066942 CHEMBL3401691
SMILES: OC(=O)CCCN1CC(Oc2c(NC(=O)c3ccc(OCCCCc4ccccc4)cc3)cccc12)C(=O)NS(=O)(=O)c1ccccc1
InChI Key: InChIKey=LONMDBXVFTVIML-UHFFFAOYSA-N
Data: 2 IC50
Activity Spreadsheet -- Enzyme Inhibition Constant Data from BindingDB
Found 2 hits for monomerid = 50066942
Trg + Lig
Ki
nM
ΔG°
kcal/mole
IC50
nM
Kd
nM
EC50/IC50
nM
koff
s-1
kon
M-1s-1
pHTemp
°C
Cysteinyl leukotriene receptor 2
(Homo sapiens (Human))
BDBM50066942
(CHEMBL3401691)
Show SMILES OC(=O)CCCN1CC(Oc2c(NC(=O)c3ccc(OCCCCc4ccccc4)cc3)cccc12)C(=O)NS(=O)(=O)c1ccccc1
Show InChI InChI=1S/C36H37N3O8S/c40-33(41)18-10-23-39-25-32(36(43)38-48(44,45)29-14-5-2-6-15-29)47-34-30(16-9-17-31(34)39)37-35(42)27-19-21-28(22-20-27)46-24-8-7-13-26-11-3-1-4-12-26/h1-6,9,11-12,14-17,19-22,32H,7-8,10,13,18,23-25H2,(H,37,42)(H,38,43)(H,40,41)
Reactome pathway
n/an/a 5.70n/an/an/an/an/an/a
Ono Pharmaceutical Co., Ltd
Curated by ChEMBL
Assay Description
Antagonist activity at human CysLT2 receptor expressed in HEK293 cells assessed as inhibition of LTD4-inudced intracellular calcium influx preincubat...
Bioorg Med Chem 23: 2079-97 (2015)
Article DOI: 10.1016/j.bmc.2015.03.011
BindingDB Entry DOI: 10.7270/Q2SB47FF
Cysteinyl leukotriene receptor 1
(Homo sapiens (Human))
BDBM50066942
(CHEMBL3401691)
Show SMILES OC(=O)CCCN1CC(Oc2c(NC(=O)c3ccc(OCCCCc4ccccc4)cc3)cccc12)C(=O)NS(=O)(=O)c1ccccc1
Show InChI InChI=1S/C36H37N3O8S/c40-33(41)18-10-23-39-25-32(36(43)38-48(44,45)29-14-5-2-6-15-29)47-34-30(16-9-17-31(34)39)37-35(42)27-19-21-28(22-20-27)46-24-8-7-13-26-11-3-1-4-12-26/h1-6,9,11-12,14-17,19-22,32H,7-8,10,13,18,23-25H2,(H,37,42)(H,38,43)(H,40,41)
Reactome pathway
n/an/a 70n/an/an/an/an/an/a
Ono Pharmaceutical Co., Ltd
Curated by ChEMBL
Assay Description
Antagonist activity at human CysLT2 receptor expressed in HEK293 cells assessed as inhibition of LTD4-inudced intracellular calcium influx preincubat...
Bioorg Med Chem 23: 2079-97 (2015)
Article DOI: 10.1016/j.bmc.2015.03.011
BindingDB Entry DOI: 10.7270/Q2SB47FF