BDBM50067783 3-Phosphoglycerate::3-phospho-D-glyceric acid
SMILES: O[C@H](COP([O-])([O-])=O)C([O-])=O
InChI Key: InChIKey=OSJPPGNTCRNQQC-UWTATZPHSA-K
Data: 1 Kd
Activity Spreadsheet -- Enzyme Inhibition Constant Data from BindingDB
Found 1 hit for monomerid = 50067783
Trg + Lig
Ki
nM
ΔG°
kcal/mole
IC50
nM
Kd
nM
EC50/IC50
nM
koff
s-1
kon
M-1s-1
pHTemp
°C
Phosphoglycerate kinase 1
(Saccharomyces cerevisiae)
BDBM50067783
(3-Phosphoglycerate | 3-phospho-D-glyceric acid)
Show SMILES O[C@H](COP([O-])([O-])=O)C([O-])=O
Show InChI InChI=1S/C3H7O7P/c4-2(3(5)6)1-10-11(7,8)9/h2,4H,1H2,(H,5,6)(H2,7,8,9)/p-3/t2-/m1/s1
Reactome pathway
n/an/an/a 1.10E+5n/an/an/an/an/a
University of Sheffield
Curated by ChEMBL
Assay Description
Dissociation constant of phosphoglycerate kinase (PGK) at pH (3.0-11.0) was determined
J Med Chem 41: 4439-52 (1998)
Article DOI: 10.1021/jm970839y
BindingDB Entry DOI: 10.7270/Q2BR8SV2