BDBM50072130 CHEMBL3407912
SMILES: OC(=O)c1cc(ncn1)-c1ccc(F)c(c1)C(F)(F)F
InChI Key: InChIKey=APXXWDOJQAHCGR-UHFFFAOYSA-N
Data: 2 IC50
Activity Spreadsheet -- Enzyme Inhibition Constant Data from BindingDB
Found 2 hits for monomerid = 50072130
Trg + Lig
Ki
nM
ΔG°
kcal/mole
IC50
nM
Kd
nM
EC50/IC50
nM
koff
s-1
kon
M-1s-1
pHTemp
°C
Kynurenine 3-monooxygenase
(Homo sapiens (Human))
BDBM50072130
(CHEMBL3407912)
Show SMILES OC(=O)c1cc(ncn1)-c1ccc(F)c(c1)C(F)(F)F
Show InChI InChI=1S/C12H6F4N2O2/c13-8-2-1-6(3-7(8)12(14,15)16)9-4-10(11(19)20)18-5-17-9/h1-5H,(H,19,20)
Reactome pathway
n/an/a>1.00E+4n/an/an/an/an/an/a
Evotec (U.K.) Ltd
Curated by ChEMBL
Assay Description
Inhibition of human KMO transfected in CHO cells assessed as conversion of kynurenine to 3-hydroxykynurenine by LC-MS/MS analysis
J Med Chem 58: 1159-83 (2015)
Article DOI: 10.1021/jm501350y
BindingDB Entry DOI: 10.7270/Q2445P5N
Kynurenine 3-monooxygenase
(Homo sapiens (Human))
BDBM50072130
(CHEMBL3407912)
Show SMILES OC(=O)c1cc(ncn1)-c1ccc(F)c(c1)C(F)(F)F
Show InChI InChI=1S/C12H6F4N2O2/c13-8-2-1-6(3-7(8)12(14,15)16)9-4-10(11(19)20)18-5-17-9/h1-5H,(H,19,20)
Reactome pathway
n/an/a 32n/an/an/an/an/an/a
Evotec (U.K.) Ltd
Curated by ChEMBL
Assay Description
Inhibition of human KMO assessed as conversion of kynurenine to 3-hydroxykynurenine by LC-MS/MS analysis
J Med Chem 58: 1159-83 (2015)
Article DOI: 10.1021/jm501350y
BindingDB Entry DOI: 10.7270/Q2445P5N