BDBM50072799 (3S,5S,10S,13S)-10,13-Dimethyl-17-pyridin-3-yl-hexadecahydro-cyclopenta[a]phenanthren-3-ol::CHEMBL3137967
SMILES: [H][C@@]12CCC(c3cccnc3)[C@@]1(C)CC[C@@]1([H])[C@@]2([H])CC[C@@]2([H])C[C@@H](O)CC[C@]12C
InChI Key: InChIKey=KSNHBAFYACINHV-GYDGNQOMSA-N
Data: 1 IC50
Activity Spreadsheet -- Enzyme Inhibition Constant Data from BindingDB
Found 1 hit for monomerid = 50072799
Trg + Lig
Ki
nM
ΔG°
kcal/mole
IC50
nM
Kd
nM
EC50/IC50
nM
koff
s-1
kon
M-1s-1
pHTemp
°C
Cytochrome P450 17A1
(Homo sapiens (Human))
BDBM50072799
((3S,5S,10S,13S)-10,13-Dimethyl-17-pyridin-3-yl-hex...)
Show SMILES [H][C@@]12CCC(c3cccnc3)[C@@]1(C)CC[C@@]1([H])[C@@]2([H])CC[C@@]2([H])C[C@@H](O)CC[C@]12C
Show InChI InChI=1S/C24H35NO/c1-23-11-9-18(26)14-17(23)5-6-19-21-8-7-20(16-4-3-13-25-15-16)24(21,2)12-10-22(19)23/h3-4,13,15,17-22,26H,5-12,14H2,1-2H3/t17-,18-,19-,20?,21-,22-,23-,24+/m0/s1
Reactome pathway
n/an/a 5n/an/an/an/an/an/a
Institute of Cancer Research
Curated by ChEMBL
Assay Description
Inhibition of human progesterone 17-alpha-hydroxylase.
J Med Chem 41: 5375-81 (1999)
Article DOI: 10.1021/jm981017j
BindingDB Entry DOI: 10.7270/Q21C1XKW