null
SMILES: COc1ccc2NC(=O)[C@@]3(C[C@H]3c3ccc4c(\C=C\c5ccc(CN6CCCCC6)cc5)n[nH]c4c3)c2c1
InChI Key:
Activity Spreadsheet -- Enzyme Inhibition Constant Data from BindingDB
Found 10 hits for monomerid = 50073584
Trg + Lig
Ki
nM
ΔG°
kcal/mole
IC50
nM
Kd
nM
EC50/IC50
nM
koff
s-1
kon
M-1s-1
pHTemp
°C
Cytochrome P450 2C9
(Homo sapiens (Human))
BDBM50073584
(CHEMBL3408944 | US10358436, Example A59 | US990780...)
Show SMILES COc1ccc2NC(=O)[C@@]3(C[C@H]3c3ccc4c(\C=C\c5ccc(CN6CCCCC6)cc5)n[nH]c4c3)c2c1 |r|
Reactome pathway
n/an/a 3.40E+3n/an/an/an/an/an/a
TBA
Curated by ChEMBL
Assay Description
Inhibition of CYP2C9 (unknown origin) by fluorescence assay
J Med Chem 58: 147-69 (2015)
Article DOI: 10.1021/jm5005336
BindingDB Entry DOI: 10.7270/Q2M0475V
Cytochrome P450 2C19
(Homo sapiens (Human))
BDBM50073584
(CHEMBL3408944 | US10358436, Example A59 | US990780...)
Show SMILES COc1ccc2NC(=O)[C@@]3(C[C@H]3c3ccc4c(\C=C\c5ccc(CN6CCCCC6)cc5)n[nH]c4c3)c2c1 |r|
Reactome pathway
n/an/a 1.40E+3n/an/an/an/an/an/a
TBA
Curated by ChEMBL
Assay Description
Inhibition of CYP2C19 (unknown origin) by fluorescence assay
J Med Chem 58: 147-69 (2015)
Article DOI: 10.1021/jm5005336
BindingDB Entry DOI: 10.7270/Q2M0475V
Cytochrome P450 3A4
(Homo sapiens (Human))
BDBM50073584
(CHEMBL3408944 | US10358436, Example A59 | US990780...)
Show SMILES COc1ccc2NC(=O)[C@@]3(C[C@H]3c3ccc4c(\C=C\c5ccc(CN6CCCCC6)cc5)n[nH]c4c3)c2c1 |r|
Reactome pathway
n/an/a 5.40E+3n/an/an/an/an/an/a
TBA
Curated by ChEMBL
Assay Description
Inhibition of CYP3A4 (unknown origin) using DBF as substrate by fluorescence assay
J Med Chem 58: 147-69 (2015)
Article DOI: 10.1021/jm5005336
BindingDB Entry DOI: 10.7270/Q2M0475V
Cytochrome P450 3A4
(Homo sapiens (Human))
BDBM50073584
(CHEMBL3408944 | US10358436, Example A59 | US990780...)
Show SMILES COc1ccc2NC(=O)[C@@]3(C[C@H]3c3ccc4c(\C=C\c5ccc(CN6CCCCC6)cc5)n[nH]c4c3)c2c1 |r|
Reactome pathway
n/an/a>1.00E+3n/an/an/an/an/an/a
TBA
Curated by ChEMBL
Assay Description
Inhibition of CYP3A4 (unknown origin) using BFC as substrate by fluorescence assay
J Med Chem 58: 147-69 (2015)
Article DOI: 10.1021/jm5005336
BindingDB Entry DOI: 10.7270/Q2M0475V
Aurora kinase B
(Homo sapiens (Human))
BDBM50073584
(CHEMBL3408944 | US10358436, Example A59 | US990780...)
Show SMILES COc1ccc2NC(=O)[C@@]3(C[C@H]3c3ccc4c(\C=C\c5ccc(CN6CCCCC6)cc5)n[nH]c4c3)c2c1 |r|
Reactome pathway
US Patent
n/an/a<100n/an/an/an/an/an/a
University Health Network
US Patent
Assay Description
Aurora B inhibition was determined using the Z-Lyte assay kit from Invitrogen. The assay was performed using the recommended manufacturer's instr...
US Patent US10358436 (2019)
BindingDB Entry DOI: 10.7270/Q2K939WH
Serine/threonine-protein kinase PLK4
(Homo sapiens (Human))
BDBM50073584
(CHEMBL3408944 | US10358436, Example A59 | US990780...)
Show SMILES COc1ccc2NC(=O)[C@@]3(C[C@H]3c3ccc4c(\C=C\c5ccc(CN6CCCCC6)cc5)n[nH]c4c3)c2c1 |r|
NCI pathway
Reactome pathway
US Patent
n/an/a<100n/an/an/an/an/an/a
The Scripps Research Institute
Assay Description
PLK4 activity was measured using an indirect ELISA detection system. Dephosphorylated GST-PLK4 (4 nM) was incubated in the presence of 15 μM ATP...
J Med Chem 50: 3359-68 (2007)
BindingDB Entry DOI: 10.7270/Q2KD216W
Aurora kinase B
(Homo sapiens (Human))
BDBM50073584
(CHEMBL3408944 | US10358436, Example A59 | US990780...)
Show SMILES COc1ccc2NC(=O)[C@@]3(C[C@H]3c3ccc4c(\C=C\c5ccc(CN6CCCCC6)cc5)n[nH]c4c3)c2c1 |r|
Reactome pathway
US Patent
n/an/a<100n/an/an/an/an/an/a
The Scripps Research Institute
Assay Description
Aurora B inhibition was determined using the Z-Lyte assay kit from Invitrogen. The assay was performed using the recommended manufacturer's instr...
J Med Chem 50: 3359-68 (2007)
BindingDB Entry DOI: 10.7270/Q2KD216W
Serine/threonine-protein kinase PLK4 [1-391]
(Homo sapiens (Human))
BDBM50073584
(CHEMBL3408944 | US10358436, Example A59 | US990780...)
Show SMILES COc1ccc2NC(=O)[C@@]3(C[C@H]3c3ccc4c(\C=C\c5ccc(CN6CCCCC6)cc5)n[nH]c4c3)c2c1 |r|
US Patent
n/an/a<100n/an/an/an/an/an/a
University Health Network
US Patent
Assay Description
Active PLK4 was purified from an E. coli expression system as an amino terminal GST fusion of residues 1-391 of human PLK4. The protein was purified ...
US Patent US10358436 (2019)
BindingDB Entry DOI: 10.7270/Q2K939WH
Aurora kinase A
(Homo sapiens (Human))
BDBM50073584
(CHEMBL3408944 | US10358436, Example A59 | US990780...)
Show SMILES COc1ccc2NC(=O)[C@@]3(C[C@H]3c3ccc4c(\C=C\c5ccc(CN6CCCCC6)cc5)n[nH]c4c3)c2c1 |r|
NCI pathway
Reactome pathway
US Patent
n/an/a<500n/an/an/an/an/an/a
University Health Network
US Patent
Assay Description
Aurora A inhibition was determined using the Z-Lyte assay kit from Invitrogen. The assay was performed using the recommended manufacturer's instr...
US Patent US10358436 (2019)
BindingDB Entry DOI: 10.7270/Q2K939WH
Serine/threonine-protein kinase PLK4
(Homo sapiens (Human))
BDBM50073584
(CHEMBL3408944 | US10358436, Example A59 | US990780...)
Show SMILES COc1ccc2NC(=O)[C@@]3(C[C@H]3c3ccc4c(\C=C\c5ccc(CN6CCCCC6)cc5)n[nH]c4c3)c2c1 |r|
NCI pathway
Reactome pathway
n/an/a 0.600n/an/an/an/an/an/a
TBA
Curated by ChEMBL
Assay Description
Inhibition of PLK4 (unknown origin) by ELISA
J Med Chem 58: 147-69 (2015)
Article DOI: 10.1021/jm5005336
BindingDB Entry DOI: 10.7270/Q2M0475V