BDBM50080534 CHEMBL333448::ethyl (4-{(2R)-2-[(1S,3S,5S)-3,5-dimethyl-2-oxocyclohexyl]-2-hydroxyethyl}-2,6-dioxopiperidin-1-yl)acetate::{4-[(R)-2-((1S,3S,5S)-3,5-Dimethyl-2-oxo-cyclohexyl)-2-hydroxy-ethyl]-2,6-dioxo-piperidin-1-yl}-acetic acid ethyl ester
SMILES: CCOC(=O)CN1C(=O)CC(C[C@@H](O)[C@@H]2C[C@@H](C)C[C@H](C)C2=O)CC1=O
InChI Key: InChIKey=KWCVNASRVVSXHH-NZBPQXDJSA-N
Data: 1 IC50
PDB links: 1 PDB ID matches this monomer.
Activity Spreadsheet -- Enzyme Inhibition Constant Data from BindingDB
Found 1 hit for monomerid = 50080534
Trg + Lig
Ki
nM
ΔG°
kcal/mole
IC50
nM
Kd
nM
EC50/IC50
nM
koff
s-1
kon
M-1s-1
pHTemp
°C
Peptidyl-prolyl cis-trans isomerase FKBP1A
(Homo sapiens (Human))
BDBM50080534
(CHEMBL333448 | ethyl (4-{(2R)-2-[(1S,3S,5S)-3,5-di...)
Show SMILES CCOC(=O)CN1C(=O)CC(C[C@@H](O)[C@@H]2C[C@@H](C)C[C@H](C)C2=O)CC1=O
Show InChI InChI=1S/C19H29NO6/c1-4-26-18(24)10-20-16(22)8-13(9-17(20)23)7-15(21)14-6-11(2)5-12(3)19(14)25/h11-15,21H,4-10H2,1-3H3/t11-,12-,14-,15+/m0/s1
NCI pathway
Reactome pathway
n/an/a 4.40E+3n/an/an/an/an/an/a
Max-Planck Research Unit
Curated by ChEMBL
Assay Description
Compound was evaluated for its inhibitory effect on human FK506 binding protein 12 by means of protease-coupled PPIase assay
J Med Chem 42: 3615-22 (1999)
Article DOI: 10.1021/jm991038t
BindingDB Entry DOI: 10.7270/Q2DB8124