BDBM50080580 CHEMBL3422430
SMILES: CC(=O)N[C@@H](Cc1c[nH]c2ccccc12)C(=O)N[C@H](Cc1ccc(I)cc1)C(=O)N[C@@H](CCCNC(N)=N)C(=O)N1Cc2ccccc2C[C@H]1C(N)=O
InChI Key:
Data: 2 EC50
Activity Spreadsheet -- Enzyme Inhibition Constant Data from BindingDB
Found 2 hits for monomerid = 50080580
Trg + Lig
Ki
nM
ΔG°
kcal/mole
IC50
nM
Kd
nM
EC50/IC50
nM
koff
s-1
kon
M-1s-1
pHTemp
°C
Melanocortin receptor 1
(Mus musculus)
BDBM50080580
(CHEMBL3422430)
Show SMILES CC(=O)N[C@@H](Cc1c[nH]c2ccccc12)C(=O)N[C@H](Cc1ccc(I)cc1)C(=O)N[C@@H](CCCNC(N)=N)C(=O)N1Cc2ccccc2C[C@H]1C(N)=O |r|
n/an/an/an/a 2.70E+3n/an/an/an/a
University of Minnesota
Curated by ChEMBL
Assay Description
Agonist activity at mouse melanocortin-1 receptor transfected in HEK293 cells after 6 hrs by beta-galactosidase reporter gene assay
ACS Med Chem Lett 6: 123-7 (2015)
Article DOI: 10.1021/ml500340z
BindingDB Entry DOI: 10.7270/Q2NC62W2
Melanocortin receptor 5 (MC5R)
(Mus musculus (Mouse))
BDBM50080580
(CHEMBL3422430)
Show SMILES CC(=O)N[C@@H](Cc1c[nH]c2ccccc12)C(=O)N[C@H](Cc1ccc(I)cc1)C(=O)N[C@@H](CCCNC(N)=N)C(=O)N1Cc2ccccc2C[C@H]1C(N)=O |r|
n/an/an/an/a 5.30E+3n/an/an/an/a
University of Minnesota
Curated by ChEMBL
Assay Description
Agonist activity at mouse melanocortin-5 receptor transfected in HEK293 cells after 6 hrs by beta-galactosidase reporter gene assay
ACS Med Chem Lett 6: 123-7 (2015)
Article DOI: 10.1021/ml500340z
BindingDB Entry DOI: 10.7270/Q2NC62W2