BDBM50083876 3-(6-Bromo-hex-2-enyl)-6,6,9-trimethyl-6a,7,10,10a-tetrahydro-6H-benzo[c]chromen-1-ol::CHEMBL162746
SMILES: CC1=CCC2C(C1)c1c(O)cc(C\C=C\CCCBr)cc1OC2(C)C
InChI Key: InChIKey=JXQDCHGSXWEBFI-GQCTYLIASA-N
Data: 1 Kd
Activity Spreadsheet -- Enzyme Inhibition Constant Data from BindingDB
Found 1 hit for monomerid = 50083876
Trg + Lig
Ki
nM
ΔG°
kcal/mole
IC50
nM
Kd
nM
EC50/IC50
nM
koff
s-1
kon
M-1s-1
pHTemp
°C
Cannabinoid receptor 1
(Homo sapiens (Human))
BDBM50083876
(3-(6-Bromo-hex-2-enyl)-6,6,9-trimethyl-6a,7,10,10a...)
Show SMILES CC1=CCC2C(C1)c1c(O)cc(C\C=C\CCCBr)cc1OC2(C)C |t:1|
Show InChI InChI=1S/C22H29BrO2/c1-15-9-10-18-17(12-15)21-19(24)13-16(8-6-4-5-7-11-23)14-20(21)25-22(18,2)3/h4,6,9,13-14,17-18,24H,5,7-8,10-12H2,1-3H3/b6-4+
NCI pathway
Reactome pathway
n/an/an/a 1.66n/an/an/an/an/a
Research Triangle Institute
Curated by ChEMBL
Assay Description
Binding affinity against Cannabinoid receptor 1.
J Med Chem 43: 59-70 (2000)
BindingDB Entry DOI: 10.7270/Q2WQ0305