BDBM50084885 CHEMBL3427344
SMILES: CCC\C=C\C=N\N1CCN(CC1)c1ccccc1
InChI Key: InChIKey=SYIYCIKLWXXGJS-BAGULLTOSA-N
Data: 1 IC50
Activity Spreadsheet -- Enzyme Inhibition Constant Data from BindingDB
Found 1 hit for monomerid = 50084885
Trg + Lig
Ki
nM
ΔG°
kcal/mole
IC50
nM
Kd
nM
EC50/IC50
nM
koff
s-1
kon
M-1s-1
pHTemp
°C
Patatin-like phospholipase domain-containing protein 2
(Mus musculus)
BDBM50084885
(CHEMBL3427344)
Show SMILES CCC\C=C\C=N\N1CCN(CC1)c1ccccc1
Show InChI InChI=1S/C16H23N3/c1-2-3-4-8-11-17-19-14-12-18(13-15-19)16-9-6-5-7-10-16/h4-11H,2-3,12-15H2,1H3/b8-4+,17-11+
n/an/a>2.00E+5n/an/an/an/an/an/a
Graz University of Technology
Curated by ChEMBL
Assay Description
Inhibition of mouse recombinant ATGL expressed in African green monkey COS7 cells assessed as reduction in triglyceride hydrolase activity using radi...
Bioorg Med Chem 23: 2904-16 (2015)
Article DOI: 10.1016/j.bmc.2015.02.051
BindingDB Entry DOI: 10.7270/Q2086710