BDBM50087509 CHEMBL3426750
SMILES: Nc1ncnc2n(CCc3ccccc3)c(Sc3cc(Cl)cc(Cl)c3)nc12
InChI Key: InChIKey=CVPIOYVUNCZFCF-UHFFFAOYSA-N
Data: 4 IC50
Activity Spreadsheet -- Enzyme Inhibition Constant Data from BindingDB
Found 4 hits for monomerid = 50087509
Trg + Lig
Ki
nM
ΔG°
kcal/mole
IC50
nM
Kd
nM
EC50/IC50
nM
koff
s-1
kon
M-1s-1
pHTemp
°C
Heat shock protein HSP 90-alpha
(Homo sapiens (Human))
BDBM50087509
(CHEMBL3426750)
Show SMILES Nc1ncnc2n(CCc3ccccc3)c(Sc3cc(Cl)cc(Cl)c3)nc12
Show InChI InChI=1S/C19H15Cl2N5S/c20-13-8-14(21)10-15(9-13)27-19-25-16-17(22)23-11-24-18(16)26(19)7-6-12-4-2-1-3-5-12/h1-5,8-11H,6-7H2,(H2,22,23,24)
NCI pathway
Reactome pathway
n/an/a>5.00E+4n/an/an/an/an/an/a
Sloan-Kettering
Curated by ChEMBL
Assay Description
Displacement of Cy3B-GM from recombinant Hsp90alpha (unknown origin) after 24 hrs by fluorescence polarization assay
J Med Chem 58: 3922-43 (2015)
Article DOI: 10.1021/acs.jmedchem.5b00197
BindingDB Entry DOI: 10.7270/Q2CC12DD
Heat shock protein HSP 90-beta
(Homo sapiens (Human))
BDBM50087509
(CHEMBL3426750)
Show SMILES Nc1ncnc2n(CCc3ccccc3)c(Sc3cc(Cl)cc(Cl)c3)nc12
Show InChI InChI=1S/C19H15Cl2N5S/c20-13-8-14(21)10-15(9-13)27-19-25-16-17(22)23-11-24-18(16)26(19)7-6-12-4-2-1-3-5-12/h1-5,8-11H,6-7H2,(H2,22,23,24)
Reactome pathway
n/an/a>1.00E+5n/an/an/an/an/an/a
Sloan-Kettering
Curated by ChEMBL
Assay Description
Displacement of Cy3B-GM from recombinant Hsp90beta (unknown origin) after 24 hrs by fluorescence polarization assay
J Med Chem 58: 3922-43 (2015)
Article DOI: 10.1021/acs.jmedchem.5b00197
BindingDB Entry DOI: 10.7270/Q2CC12DD
Heat shock protein 75 kDa, mitochondrial
(Homo sapiens (Human))
BDBM50087509
(CHEMBL3426750)
Show SMILES Nc1ncnc2n(CCc3ccccc3)c(Sc3cc(Cl)cc(Cl)c3)nc12
Show InChI InChI=1S/C19H15Cl2N5S/c20-13-8-14(21)10-15(9-13)27-19-25-16-17(22)23-11-24-18(16)26(19)7-6-12-4-2-1-3-5-12/h1-5,8-11H,6-7H2,(H2,22,23,24)
n/an/a>1.00E+5n/an/an/an/an/an/a
Sloan-Kettering
Curated by ChEMBL
Assay Description
Displacement of PU-FITC3 from recombinant TRAP-1 (unknown origin) after 24 hrs by fluorescence polarization assay
J Med Chem 58: 3922-43 (2015)
Article DOI: 10.1021/acs.jmedchem.5b00197
BindingDB Entry DOI: 10.7270/Q2CC12DD
Endoplasmin
(Homo sapiens (Human))
BDBM50087509
(CHEMBL3426750)
Show SMILES Nc1ncnc2n(CCc3ccccc3)c(Sc3cc(Cl)cc(Cl)c3)nc12
Show InChI InChI=1S/C19H15Cl2N5S/c20-13-8-14(21)10-15(9-13)27-19-25-16-17(22)23-11-24-18(16)26(19)7-6-12-4-2-1-3-5-12/h1-5,8-11H,6-7H2,(H2,22,23,24)
n/an/a>2.50E+3n/an/an/an/an/an/a
Sloan-Kettering
Curated by ChEMBL
Assay Description
Displacement of Cy3B-GM from recombinant Grp94 (unknown origin) after 24 hrs by fluorescence polarization assay
J Med Chem 58: 3922-43 (2015)
Article DOI: 10.1021/acs.jmedchem.5b00197
BindingDB Entry DOI: 10.7270/Q2CC12DD