BDBM50087679 2-[1-Hydroxy-3-((E)-3-hydroxy-7-phenyl-hept-1-enyl)-cyclohexyl]-N,N-dimethyl-acetamide::CHEMBL169055
SMILES: CN(C)C(=O)CC1(O)CCCC(C1)\C=C\C(O)CCCCc1ccccc1
InChI Key: InChIKey=LQQOFRLZJKZLCO-CCEZHUSRSA-N
Data: 1 IC50
Activity Spreadsheet -- Enzyme Inhibition Constant Data from BindingDB
Found 1 hit for monomerid = 50087679
Trg + Lig
Ki
nM
ΔG°
kcal/mole
IC50
nM
Kd
nM
EC50/IC50
nM
koff
s-1
kon
M-1s-1
pHTemp
°C
Leukotriene B4 receptor
(Homo sapiens (Human))
BDBM50087679
(2-[1-Hydroxy-3-((E)-3-hydroxy-7-phenyl-hept-1-enyl...)
Show SMILES CN(C)C(=O)CC1(O)CCCC(C1)\C=C\C(O)CCCCc1ccccc1
Show InChI InChI=1S/C23H35NO3/c1-24(2)22(26)18-23(27)16-8-12-20(17-23)14-15-21(25)13-7-6-11-19-9-4-3-5-10-19/h3-5,9-10,14-15,20-21,25,27H,6-8,11-13,16-18H2,1-2H3/b15-14+
n/an/a 40n/an/an/an/an/an/a
UPRESA-CNRS 5074
Curated by ChEMBL
Assay Description
Compound was tested for inhibition against binding of radioligand [3H]-LTB4 to Leukotriene B4 receptor in human neutrophil membranes
Bioorg Med Chem Lett 10: 811-4 (2000)
BindingDB Entry DOI: 10.7270/Q2W37VHF