BDBM50088526 CHEMBL3527591
SMILES: [H][C@@]1([#6@H](-[#8]-[#6])-[#6@@H](-[#6]-[#6][C@]11[#6]-[#8]1)-[#8]-[#6](=O)-[#7]-[#6@@H](-[#6](-[#7])=O)C([#6])([#6])[#8])[C@@]1([#6])[#8]-[#6@@H]1-[#6]\[#6]=[#6](\[#6])-[#6]
InChI Key: InChIKey=UWRJTEUTWJCBSE-PRFNVREFSA-N
Data: 1 EC50
Activity Spreadsheet -- Enzyme Inhibition Constant Data from BindingDB
Found 1 hit for monomerid = 50088526
Trg + Lig
Ki
nM
ΔG°
kcal/mole
IC50
nM
Kd
nM
EC50/IC50
nM
koff
s-1
kon
M-1s-1
pHTemp
°C
Microtubule-associated protein 2
(Homo sapiens (Human))
BDBM50088526
(CHEMBL3527591)
Show SMILES [H][C@@]1([#6@H](-[#8]-[#6])-[#6@@H](-[#6]-[#6][C@]11[#6]-[#8]1)-[#8]-[#6](=O)-[#7]-[#6@@H](-[#6](-[#7])=O)C([#6])([#6])[#8])[C@@]1([#6])[#8]-[#6@@H]1-[#6]\[#6]=[#6](\[#6])-[#6] |r|
Show InChI InChI=1S/C22H36N2O7/c1-12(2)7-8-14-21(5,31-14)16-15(28-6)13(9-10-22(16)11-29-22)30-19(26)24-17(18(23)25)20(3,4)27/h7,13-17,27H,8-11H2,1-6H3,(H2,23,25)(H,24,26)/t13-,14-,15-,16-,17+,21+,22+/m1/s1
n/an/an/an/a 0.300n/an/an/an/a
GlaxoSmithKline
Curated by ChEMBL
Assay Description
Inhibition of MetAP2 activity in HUVEC assessed as inhibition of cell proliferation by MTT assay
Drug Metab Dispos 41: 814-26 (2013)
Article DOI: 10.1124/dmd.112.048355
BindingDB Entry DOI: 10.7270/Q2NC62XH